program: Gaussian 09
title: 000200685
version: EM64L-G09RevD.01
frameworkgroup: C1[X(C18H25NO4)]
method: RPBEPBE
basis: SDD
operation: Freq
keyword: #p
keyword: freq=noraman
keyword: PBEPBE/SDD
title: #p freq=noraman PBEPBE/SDD
converged: YES YES NO NO
title: Mulliken charges:
elementType: O O O O N C C C C C C C C C C C C C C C C C C H H H H H H H H H H H H H H H H H H H H H H H H H
charge: -0.325572 -0.260795 -0.444430 -0.444492 -0.062578 -0.150744 -0.141365 -0.486405 -0.482674 -0.465361 -0.486852 0.037211 -0.644960 0.231581 -0.024244 -0.407838 -0.405986 0.432672 -0.390098 -0.404504 -0.244916 -0.247142 -0.241842 0.237278 0.238604 0.222871 0.236740 0.235441 0.216274 0.230605 0.227025 0.228976 0.218849 0.250078 0.230837 0.229942 0.196575 0.233202 0.213605 0.229916 0.231419 0.294883 0.244850 0.365624 0.364423 0.227487 0.226330 0.229501
chargesum: 0.00000
title: Mulliken charges with hydrogens summed into heavy atoms:
elementType: O O O O N C C C C C C C C C C C C C C C C C C
charge: -0.325572 -0.260795 -0.078806 -0.080068 -0.062578 0.086534 0.097239 -0.026794 -0.030960 -0.007731 -0.039028 0.287289 0.012394 0.231581 -0.024244 0.038969 0.055349 0.432672 -0.095214 -0.159654 -0.017429 -0.020812 -0.012341
polarizability: 2.25921191e+02 -2.11388473e+01 2.02940115e+02 3.53170325e+00 2.28493340e-01 1.86649629e+02
1716.lowfreq: -17.0594 -8.1416 -6.1596 0.0006 0.0008 0.0008 9.4067 22.5675 41.9593
frequency: -10.0570 22.0299 41.9502 49.3652 66.7292 83.7714 118.6123 127.9959 140.8564 161.1322 171.8662 177.7051 202.3233 210.5073 234.8526 246.9576 269.1533 280.3724 302.5915 327.3048 328.9575 350.3720 361.5799 373.9117 403.9293 429.7503 450.0685 474.0736 491.8365 501.2966 516.6390 528.3784 567.2210 612.7299 615.6708 659.1181 693.4196 703.9333 710.1082 738.7053 753.9331 768.0450 768.8250 781.9598 818.8605 836.6825 848.7778 854.7242 866.7929 893.8795 911.1948 919.9721 928.5772 962.5396 973.2272 976.8397 978.2140 979.5868 990.0580 996.2763 998.3967 1024.3572 1028.9679 1044.0853 1044.9845 1048.8229 1071.1665 1072.3219 1101.3116 1108.7976 1114.8891 1128.3321 1139.3644 1148.7360 1154.2080 1174.3267 1182.9133 1197.7024 1202.0446 1204.8790 1217.9977 1224.0644 1241.8625 1255.4112 1259.7960 1273.1500 1288.3031 1292.3290 1308.4280 1313.4176 1323.4230 1334.5585 1343.0217 1343.9393 1351.6833 1361.4158 1369.0045 1377.9683 1397.4618 1429.6362 1435.3781 1448.2876 1457.2738 1461.9788 1466.9173 1468.8191 1483.7100 1484.6179 1487.4729 1490.4056 1587.9552 1595.1734 1611.1819 2889.2222 2987.3296 2997.0914 3004.9704 3006.7006 3009.9593 3017.6536 3027.0685 3029.2965 3045.9408 3055.7501 3058.2922 3058.5816 3073.4400 3077.9818 3081.6765 3083.5045 3085.6236 3112.7856 3127.6307 3140.8360 3158.8541 3177.4523 3486.7592 3522.7270
redmass: 3.8359 5.0072 4.0231 4.7700 5.5091 5.4771 4.6520 4.6800 5.7786 4.5838 3.7008 2.1283 3.4364 1.0974 3.2808 3.2486 3.5746 2.1529 3.7123 5.1795 3.3031 3.8282 2.7006 2.9722 2.8332 4.5624 2.7444 1.8862 2.9045 3.2393 1.8055 1.3026 2.5541 3.4565 6.1410 5.5028 4.6128 2.1604 3.6684 4.4853 4.7859 2.8847 2.1866 1.9012 2.5510 2.2688 2.6671 1.4097 1.5743 1.8610 3.2112 1.5210 3.4041 2.0893 4.4469 1.4727 1.9507 2.2129 3.8551 1.5016 3.5103 3.0541 2.0834 2.3247 1.8454 2.9524 2.1365 2.1995 1.7891 1.6454 1.3472 1.9226 2.2058 1.3231 2.0223 1.0538 1.9169 1.4553 1.1271 1.5627 1.8978 1.4570 1.5766 1.4500 1.3795 1.3825 1.4501 1.4973 1.3355 1.3086 1.3574 1.3192 1.3305 1.3770 1.4979 1.3816 1.2016 6.9659 1.1722 1.1632 2.2435 1.0898 1.0896 1.0963 1.0597 1.0705 2.0421 1.0517 1.1043 1.0886 6.2731 8.5193 6.0654 1.0528 1.0633 1.0626 1.0588 1.0599 1.0602 1.0628 1.0766 1.0860 1.0895 1.0904 1.1011 1.1007 1.1036 1.1037 1.1006 1.1038 1.1024 1.0874 1.0871 1.0931 1.0987 1.0961 1.0650 1.0650
irintensity: 0.1161 0.3812 0.1704 0.3011 0.9809 0.3808 0.9271 1.6807 4.6238 3.2866 4.8363 0.4257 0.5566 0.0891 6.6342 1.4980 2.5761 0.4061 1.6402 0.4938 5.0640 6.0059 2.0609 0.8428 0.5740 10.1292 1.2525 41.3790 16.9298 13.3720 111.2399 127.6398 104.1282 28.3680 1.8010 6.3531 11.1333 33.0468 40.4767 0.6566 3.6184 27.0673 12.7749 11.8879 1.7137 11.2801 2.9363 1.3573 0.1844 19.7932 33.3836 1.3704 56.0903 3.5730 97.7645 1.4793 2.3648 5.5346 0.8026 3.4922 29.1194 35.4896 68.7550 18.1037 55.5013 96.4932 15.4629 11.0096 38.1940 5.7108 5.8052 14.8700 314.7655 11.3708 4.1218 0.5911 28.8763 1.6045 2.1419 11.6358 21.2207 7.9013 0.7193 36.8722 13.4175 0.3977 14.6620 5.5170 1.3127 1.5414 19.1935 9.8795 19.6223 28.9078 2.6741 4.9372 27.4588 1.1667 30.7212 5.6583 8.2138 7.0349 14.7431 9.3240 10.3472 13.1963 29.1081 1.9907 7.2288 26.4361 25.2588 106.6997 8.1092 111.5005 35.6268 40.6536 14.5486 25.6283 15.5406 40.2196 45.8729 7.7526 51.5365 8.4955 11.6690 28.8512 9.9191 41.8647 32.0995 60.3630 18.5026 6.4548 1.5335 27.8718 28.3517 5.9285 88.9204 26.0946
temp: 298.150 k
press: 1.00000 atm
elementType: 8 8 8 8 7 6 6 6 6 6 6 6 6 6 6 6 6 6 6 6 6 6 6 1 1 1 1 1 1 1 1 1 1 1 1 1 1 1 1 1 1 1 1 1 1 1 1 1
symmnumber: 1
zpe: 1057801.0 jmol-1
zpe.correction: 0.402895 hartree
zpe.thermalcorrener: 0.423943 hartree
zpe.thermalcorrenthalpy: 0.424887 hartree
zpe.thermalcorrgfe: 0.353280 hartree
zpe.sumelectzpe: -1054.778978 hartree
zpe.sumelectthermal: -1054.757930 hartree
zpe.sumelectthermalent: -1054.756986 hartree
zpe.sumelectthermalfe: -1054.828593 hartree
dipole: -3.4540 -2.8153 -2.2043
dipole: 4.9714
quadrupole: -120.9835 -140.7067 -144.2520
quadrupole: -7.7427 0.2088 1.8183
quadrupole: 14.3306 -5.3926 -8.9379 -7.7427 0.2088 1.8183
hfenergy: -1055.1818734 hartree
pointgroup: C01 [X(C18H25N1O4)]
dipole: -1.217496 1.0442268 1.1193109 debye
polarizability: 226.5672946|20.7478371|201.3806619|-5.2044952|-0.0739648|187.5629786 unknown
InChI: InChI=1S/C18H25NO4/c1-19-14-7-8-15(19)10-16(9-14)23-17(22)18(11-20,12-21)13-5-3-2-4-6-13/h2-6,14-16,20-21H,7-12H2,1H3
charge 0 multiplicity 1
48 atoms
O  -0.274506 -0.219158 -0.391188
O  0.387256 -1.738109 1.239393
O  0.982828 -0.404164 -2.842218
O  2.087416 -3.618435 -0.060746
N  -4.370586 0.495488 -0.49248
C  -4.032463 -0.771425 0.234533
C  -3.605475 1.507142 0.306535
C  -4.156489 -0.413646 1.7631
C  -3.870034 1.126488 1.81181
C  -2.580923 -1.155224 -0.157724
C  -2.109057 1.365172 -0.079254
C  -1.611942 -0.041902 0.289568
C  -5.824534 0.770442 -0.576847
C  0.641913 -1.090164 0.190904
C  1.964819 -1.14935 -0.597265
C  1.673707 -1.456458 -2.104125
C  2.805162 -2.346093 -0.024383
C  2.75419 0.157405 -0.359379
C  3.306526 0.914922 -1.422712
C  2.988057 0.584477 0.976327
C  4.085612 2.063059 -1.151776
C  3.758917 1.735401 1.244712
C  4.317529 2.47785 0.178871
H  -4.720856 -1.578449 -0.069484
H  -3.952055 2.525295 0.060165
H  -3.449116 -0.996523 2.37935
H  -5.172481 -0.639454 2.131631
H  -4.741181 1.680387 2.20331
H  -3.0087 1.376364 2.457018
H  -2.291129 -2.116415 0.303638
H  -2.537805 -1.260199 -1.256888
H  -2.018795 1.516447 -1.169754
H  -1.495339 2.130658 0.429982
H  -1.415104 -0.125876 1.373708
H  -6.307458 -0.025504 -1.170859
H  -5.980041 1.726794 -1.106777
H  -6.349097 0.832019 0.406825
H  1.124251 -2.417448 -2.159865
H  2.639934 -1.591365 -2.622003
H  3.135222 -2.104903 1.004094
H  3.695511 -2.486003 -0.659859
H  3.098017 0.6342 -2.458063
H  2.558761 0.019304 1.813702
H  0.228883 -0.08522 -2.27688
H  1.391602 -3.576536 0.647269
H  4.503749 2.639428 -1.984846
H  3.926533 2.049582 2.281119
H  4.919871 3.370202 0.382912
