program: Gaussian 09
title: 000200676
version: EM64L-G09RevD.01
frameworkgroup: C1[X(C16H20ClNOS)]
method: RPBEPBE
basis: SDD
operation: Freq
keyword: #p
keyword: freq=noraman
keyword: PBEPBE/SDD
title: #p freq=noraman PBEPBE/SDD
converged: YES YES NO NO
title: Mulliken charges:
elementType: Cl S O N C C C C C C C C C C C C C C C C H H H H H H H H H H H H H H H H H H H H
charge: -0.091546 0.330811 -0.467197 -0.079335 0.349746 -0.429935 -0.675538 -0.381598 -0.245024 0.642986 -0.318547 -0.343589 -0.363882 -0.621119 -0.617256 -0.146689 -0.534788 -0.240701 -0.235797 -0.229222 0.209086 0.213592 0.246534 0.232156 0.212180 0.243539 0.343968 0.255247 0.254235 0.187818 0.219498 0.223255 0.217652 0.187437 0.228414 0.241782 0.258435 0.255672 0.232215 0.235508
chargesum: 0.00000
title: Mulliken charges with hydrogens summed into heavy atoms:
elementType: Cl S O N C C C C C C C C C C C C C C C C
charge: -0.091546 0.330811 -0.123229 -0.079335 0.349746 -0.007257 -0.196848 0.074121 -0.245024 0.642986 -0.063300 -0.343589 -0.109648 0.009452 0.016246 0.095093 -0.276353 0.014970 -0.003583 0.006286
polarizability: 2.22421982e+02 9.59484072e+00 2.24231938e+02 -2.02801334e+01 1.30053377e+01 1.51269943e+02
1716.lowfreq: -9.1411 -3.3469 -0.0017 -0.0007 -0.0005 4.8952 13.1049 27.3926 37.3021
frequency: 10.6439 27.3591 37.2654 46.6938 49.2794 68.8470 94.8201 112.2478 132.5666 158.1610 179.8800 202.3584 214.1430 225.3997 239.2928 250.9937 260.4492 306.6056 318.0475 343.5745 363.9842 371.6075 406.0462 424.7235 429.8936 439.1755 452.3594 480.7631 501.9843 552.1889 565.5170 588.0681 635.0935 649.7991 662.6402 694.7010 698.2655 731.6592 759.7594 788.5882 808.3689 819.9810 821.7141 827.9828 847.7382 872.9086 902.4618 941.1191 951.9521 974.4076 990.0741 1005.0989 1013.4050 1031.7170 1035.8191 1038.0886 1054.7467 1070.1126 1079.9928 1087.0477 1093.9941 1119.9185 1133.0428 1149.0634 1165.1391 1170.9219 1182.9672 1215.2976 1222.9563 1233.3641 1260.4924 1284.9101 1289.8323 1298.4310 1313.5940 1331.2933 1360.5945 1376.1894 1384.9079 1417.0531 1425.8892 1441.2165 1451.2977 1460.9558 1463.7933 1465.0323 1469.4314 1476.1776 1477.3016 1479.7170 1487.5202 1547.9606 1572.4957 1609.6997 2842.1309 2855.1892 2886.5298 2981.2283 3000.4468 3016.3581 3024.5054 3029.2624 3048.6710 3062.9403 3075.8153 3081.4609 3134.1707 3145.9108 3155.3938 3161.9029 3176.8192 3177.6283 3231.6208 3513.1525
redmass: 2.9886 5.1902 6.1347 5.4772 4.5216 4.8819 4.1455 4.0802 2.9008 5.2802 4.3264 2.7954 3.6328 1.6888 2.1997 1.2754 5.0795 3.4197 3.9770 2.5840 4.0017 1.3237 3.0708 2.7572 2.5179 3.1145 3.5925 3.9539 4.3540 4.0959 3.3218 4.2584 6.5360 4.7878 5.1094 3.7513 1.3693 4.1164 1.3002 1.6663 2.6237 3.7382 4.0815 1.3927 2.8633 1.4400 1.3622 2.0238 1.3957 3.3327 1.3431 4.7579 3.0607 1.6807 2.0444 2.0974 1.9631 1.8699 1.8205 1.2666 1.7627 1.5981 1.5482 2.2074 1.3814 1.2135 1.1188 2.3347 1.4151 1.6810 2.5434 1.4394 1.3071 1.4008 1.3965 2.1823 2.0092 3.1932 1.6470 1.1458 2.1883 1.1702 1.0914 1.0546 2.0042 1.2711 1.2394 1.0514 2.6378 1.1655 1.0627 5.7988 5.9671 7.2996 1.0574 1.0579 1.0687 1.0590 1.0597 1.0722 1.0742 1.0888 1.0992 1.1013 1.1008 1.1002 1.0862 1.0907 1.0908 1.0956 1.0993 1.0961 1.1000 1.0665
irintensity: 0.5447 0.3535 0.0936 0.5910 1.4218 0.1610 0.9167 3.1275 1.3236 1.0648 2.3530 0.6877 1.2765 2.3609 1.5593 3.0103 5.9832 7.4468 11.9552 19.0681 37.9658 144.2116 17.4495 8.1014 6.7524 7.0149 6.2077 1.5799 1.5724 5.8298 5.3509 3.6103 4.5002 7.0982 14.3509 19.8595 95.9568 14.0752 73.5408 1.1148 10.3224 21.7955 3.5169 15.5296 7.8433 0.2905 1.2912 8.0013 2.4987 16.8722 0.6146 26.6182 54.5591 22.9941 27.9767 4.6780 6.8512 13.2688 21.4634 9.7957 16.3062 4.7896 6.2381 23.3862 4.0813 7.4140 5.7935 0.7953 33.0607 10.4821 4.3639 2.5843 6.2007 29.3424 7.4758 3.3822 10.2117 1.9725 12.3345 3.3930 20.9865 2.5303 0.1726 18.9266 34.6581 13.2092 0.8619 17.7041 6.4985 9.2691 18.6510 0.9428 9.0548 0.8463 71.1561 157.9223 79.2319 17.7285 25.3520 42.6675 52.8613 2.7501 28.5163 20.1826 32.6571 58.6857 0.7891 10.8359 7.3999 13.3034 11.2606 6.6856 1.6337 68.1209
temp: 298.150 k
press: 1.00000 atm
elementType: 17 16 8 7 6 6 6 6 6 6 6 6 6 6 6 6 6 6 6 6 1 1 1 1 1 1 1 1 1 1 1 1 1 1 1 1 1 1 1 1
symmnumber: 1
zpe: 843868.3 jmol-1
zpe.correction: 0.321412 hartree
zpe.thermalcorrener: 0.342270 hartree
zpe.thermalcorrenthalpy: 0.343214 hartree
zpe.thermalcorrgfe: 0.269187 hartree
zpe.sumelectzpe: -1608.257825 hartree
zpe.sumelectthermal: -1608.236968 hartree
zpe.sumelectthermalent: -1608.236024 hartree
zpe.sumelectthermalfe: -1608.310051 hartree
dipole: 0.9115 0.6182 1.5320
dipole: 1.8868
quadrupole: -122.8867 -125.7823 -136.4119
quadrupole: 5.2424 -0.8225 2.7951
quadrupole: 5.4736 2.5779 -8.0516 5.2424 -0.8225 2.7951
hfenergy: -1608.579238 hartree
pointgroup: C01 [X(C16H20Cl1N1O1S1)]
dipole: 0.3853882 0.241204 0.5868083 debye
polarizability: 222.4469828|9.3494746|223.9631118|-21.5708729|11.7276344|151.5137687 unknown
InChI: InChI=1S/C16H20ClNOS/c1-18(2)10-9-16(19,15-8-5-11-20-15)12-13-6-3-4-7-14(13)17/h3-8,11,19H,9-10,12H2,1-2H3
charge 0 multiplicity 1
40 atoms
Cl 1.917171 -3.27384 -0.525974
S  0.220999 1.867266 -1.540078
O  -0.333608 -0.914292 -1.240285
N  -4.420047 -0.774697 0.360893
C  -0.540794 -0.366545 0.115429
C  -1.927127 -0.820188 0.661738
C  0.573259 -0.892824 1.100409
C  -3.109597 -0.398543 -0.231532
C  -0.460182 1.140037 -0.036158
C  1.999073 -0.690254 0.627105
C  -0.81324 2.124542 0.877223
C  2.71967 -1.658904 -0.109913
C  2.691505 0.518872 0.91068
C  -4.669073 -2.231108 0.345428
C  -5.534844 -0.033955 -0.266377
C  -0.550803 3.468219 0.41886
C  0.002054 3.509641 -0.851744
C  4.042436 -1.479727 -0.552523
C  4.01705 0.735998 0.480112
C  4.696701 -0.263604 -0.252244
H  -2.088395 -0.406479 1.676051
H  -1.893779 -1.923015 0.763391
H  0.381439 -1.969352 1.270954
H  0.426039 -0.375517 2.065206
H  -2.969126 -0.828611 -1.253828
H  -3.094678 0.701362 -0.338752
H  0.005493 -1.845416 -1.173781
H  -1.260579 1.901872 1.850311
H  2.163548 1.298093 1.471489
H  -4.68764 -2.662084 -0.689151
H  -5.643627 -2.442542 0.821126
H  -3.894199 -2.763493 0.92335
H  -6.479934 -0.273823 0.254158
H  -5.671566 -0.269104 -1.353241
H  -5.358469 1.052303 -0.17267
H  -0.772541 4.361751 1.008089
H  0.286119 4.37645 -1.446518
H  4.54767 -2.266967 -1.118922
H  4.517082 1.681708 0.713637
H  5.726437 -0.106537 -0.590046
