program: Gaussian 09
title: 000200624
version: EM64L-G09RevD.01
frameworkgroup: C1[X(C9H5F6NO)]
method: RPBEPBE
basis: SDD
operation: Freq
keyword: #p
keyword: freq=noraman
keyword: PBEPBE/SDD
title: #p freq=noraman PBEPBE/SDD
converged: YES YES NO NO
title: Mulliken charges:
elementType: F F F F F F O N C C C C C C C C C H H H H H
charge: -0.144463 -0.179969 -0.156557 -0.134068 -0.170368 -0.134044 -0.191623 -0.470039 0.420319 0.098934 -0.313473 -0.327741 0.246737 -0.217456 -0.232965 0.144931 0.298718 0.312033 0.269963 0.389328 0.244610 0.247192
chargesum: 0.00000
title: Mulliken charges with hydrogens summed into heavy atoms:
elementType: F F F F F F O N C C C C C C C C C
charge: -0.144463 -0.179969 -0.156557 -0.134068 -0.170368 -0.134044 -0.191623 -0.080710 0.420319 0.098934 -0.001440 -0.057777 0.246737 0.027153 0.014227 0.144931 0.298718
polarizability: 1.57913565e+02 -4.20427557e+00 1.21311370e+02 2.10767548e+00 1.07410656e+00 5.76166830e+01
1716.lowfreq: -9.6203 -5.7190 0.0003 0.0009 0.0013 1.8506 16.7298 31.8748 40.4857
frequency: 16.5148 31.8662 40.4524 81.5666 82.8631 118.3800 179.1159 203.4701 216.2315 263.4086 274.7023 297.4439 335.7268 339.2665 380.1155 412.2777 427.8324 440.5150 499.5365 513.6971 523.6745 564.5569 577.6779 605.9190 646.4350 698.5659 701.7635 727.7400 748.6287 779.1672 820.4934 855.0844 897.8770 950.8253 973.9520 982.5893 1007.4705 1017.8128 1029.5394 1040.1682 1060.2754 1080.0058 1139.0772 1186.7343 1217.9244 1250.5392 1281.5328 1312.5827 1381.7805 1445.6501 1478.8732 1545.0144 1601.5677 1620.3365 1652.2002 3150.0076 3166.2895 3183.3807 3201.2566 3466.9461
redmass: 16.8839 15.1181 14.6574 5.8122 10.9458 6.1875 12.3744 8.0230 8.3268 12.6887 9.6074 14.8726 7.1948 6.3993 14.5324 9.9411 6.4929 15.5214 14.1728 4.0377 10.0750 4.5231 8.9010 10.6928 12.2918 4.1653 8.6779 1.7913 3.1392 1.2842 6.9363 7.2039 1.4003 5.4954 1.6583 5.4173 1.3362 9.3710 6.6906 11.8056 2.4625 7.1426 2.0091 1.0642 4.9439 2.3074 2.6245 1.8467 10.4669 2.5525 2.4606 2.1887 4.5308 4.7140 6.4297 1.0876 1.0921 1.0981 1.0956 1.0774
irintensity: 0.2340 1.4286 1.0577 1.7227 0.8727 0.4680 4.7296 5.5235 4.4368 0.8191 0.2931 3.4259 5.2002 6.7687 4.1401 1.2217 0.9794 5.8496 6.1402 12.1199 3.8909 0.2593 19.8665 14.7595 9.3420 0.5263 3.4992 18.0196 0.9451 131.4326 16.3768 45.4089 3.2170 197.9840 18.7819 111.6248 0.0895 259.8468 43.8371 278.9353 17.9742 290.4190 23.3405 3.2304 57.7744 132.9682 174.4113 37.9860 25.8826 68.6365 21.3869 169.7304 145.0961 56.6848 210.3715 3.5040 6.0831 5.7103 7.1958 106.5692
temp: 298.150 k
press: 1.00000 atm
elementType: 9 9 9 9 9 9 8 7 6 6 6 6 6 6 6 6 6 1 1 1 1 1
symmnumber: 1
zpe: 345283.5 jmol-1
zpe.correction: 0.131512 hartree
zpe.thermalcorrener: 0.146608 hartree
zpe.thermalcorrenthalpy: 0.147552 hartree
zpe.thermalcorrgfe: 0.086603 hartree
zpe.sumelectzpe: -1073.762632 hartree
zpe.sumelectthermal: -1073.747536 hartree
zpe.sumelectthermalent: -1073.746591 hartree
zpe.sumelectthermalfe: -1073.807541 hartree
dipole: -4.4409 2.0244 -0.5583
dipole: 4.9123
quadrupole: -94.9350 -95.9394 -98.4230
quadrupole: -11.5555 -0.5161 -0.6741
quadrupole: 1.4975 0.4931 -1.9906 -11.5555 -0.5161 -0.6741
hfenergy: -1073.8941438 hartree
pointgroup: C01 [X(C9H5F6N1O1)]
dipole: -1.7361414 0.8189837 -0.2242115 debye
dipolederiv: -0.6496385 -0.2200011 -0.1112951 -0.2826465 -0.5537483 -0.0808185 -0.0994892 -0.045422 -0.2913987 -0.5163287 0.1282665 0.240752 0.0585346 -0.5846859 -0.1583653 0.1994925 -0.1431033 -0.5559198 -0.3016321 0.1410401 -0.1467461 0.0126278 -0.6638197 0.1871469 -0.0815479 0.2557509 -0.636948 -0.5947197 0.0903085 -0.2495803 0.1253074 -0.2859002 0.0701492 -0.2426912 0.0396462 -0.6738084 -0.520763 -0.0110822 -0.025976 0.0030848 -0.7862295 -0.1401679 -0.0261926 -0.1391529 -0.3233092 -0.7108659 -0.0568344 0.2584133 -0.0188406 -0.330401 0.1076852 0.27032 0.1272373 -0.525194 -0.6932067 0.0197833 -0.0287797 -0.6362636 -0.7006558 -0.1714096 -0.2076197 -0.1038818 -0.3428507 -1.5888669 -0.0879829 -0.1355071 -0.0639007 -0.4630468 -0.0499226 -0.1535223 -0.0478811 -0.2970581 0.8969978 -0.0623611 0.0219001 -0.5157146 0.2272443 -0.0362947 -0.0607759 0.0083362 0.1213133 -0.1733567 0.0766519 0.0160125 -0.074216 -0.528384 -0.0363146 -0.0009602 -0.0655847 -0.2074767 -0.2262138 0.0815218 -0.0007864 0.2764922 -0.1795758 0.0097599 0.0461712 0.0071726 -0.1345508 -0.0258581 -0.1376717 -0.0130671 0.2122548 0.1194526 0.0370755 0.0197592 0.0230889 -0.0858584 1.3659055 -0.0398492 0.0079074 0.2619292 2.0820777 0.0756754 -0.0345697 -0.0446624 1.5070033 0.1511714 0.0031223 0.0157973 -0.0455805 0.2134095 0.0347732 0.0154608 0.042367 -0.1071981 -0.0357102 -0.1033224 -0.0048806 -0.2204888 -0.1658627 -0.0128868 -0.0122551 -0.0036592 -0.1524095 1.3694785 0.1646675 0.1635216 0.9656265 0.8241244 0.2831836 0.3508568 0.2040274 0.2042456 1.7884867 0.0393966 0.0269605 -0.0760543 1.3000495 -0.0700976 0.0089647 -0.0574934 1.5476633 0.1132598 -0.0572218 -0.007001 -0.0308543 0.110103 -0.0073591 0.0015208 -0.0196554 0.178458 0.0300475 -0.0504619 -0.0119725 -0.0612481 0.0748182 -0.0118157 -0.0155569 -0.0120315 0.1557298 0.286334 -0.0003455 -0.0075837 0.0161469 0.3023961 0.0006103 0.0336019 0.0115845 0.3027517 0.0883465 0.0113709 -0.0027901 0.0335882 -0.07336 -0.0226321 -0.0043859 -0.0262673 0.150092 -0.0528677 0.0710049 -0.0052991 0.0602156 0.0619945 -0.0079746 -0.0065812 -0.0104161 0.1667236 unknown
polarizability: 157.4406662|-4.8963117|120.3409592|6.9128615|7.6893736|59.0599926 unknown
InChI: InChI=1S/C9H5F6NO/c10-8(11,12)5-3-1-2-4-6(5)16-7(17)9(13,14)15/h1-4,16H
charge 0 multiplicity 1
22 atoms
F  -2.903397 -2.263255 -0.535518
F  -0.752559 -2.064555 -1.237706
F  -1.211945 -2.226972 0.972073
F  3.767299 -0.412458 1.328477
F  2.694448 -1.6027 -0.28552
F  3.995995 0.174437 -0.847847
O  2.087401 1.878147 0.574299
N  0.664541 0.073984 -0.030409
C  -0.62335 0.680719 -0.002651
C  -1.789739 -0.137641 -0.146399
C  -0.783762 2.082059 0.151945
C  -3.073455 0.452025 -0.152691
C  -1.689299 -1.632369 -0.233793
C  -2.073589 2.650745 0.148359
C  -3.222662 1.845653 -0.010069
C  1.872605 0.684648 0.245409
C  3.083536 -0.287909 0.110817
H  0.099522 2.70938 0.278124
H  -3.951955 -0.188902 -0.266521
H  0.713969 -0.913421 -0.31014
H  -2.175138 3.734426 0.266963
H  -4.220963 2.292462 -0.017503
