program: Gaussian 09
title: 000200766
version: EM64L-G09RevD.01
frameworkgroup: C1[X(C23H30O4)]
method: RPBEPBE
basis: SDD
operation: Freq
keyword: #pfreq=noraman
keyword: PBEPBE/SDD
title: #p freq=noraman PBEPBE/SDD
converged: YES YES NO NO
title: Mulliken charges:
elementType: O O O O C C C C C C C C C C C C C C C C C C C C C C C H H H H H H H H H H H H H H H H H H H H H H H H H H H H H H
charge: -0.295236 -0.200787 -0.252516 -0.235102 0.304797 -0.143972 -0.121705 -0.115776 0.241881 -0.526568 -0.549076 -0.520985 -0.516596 0.132301 -0.484224 -0.825539 -0.649681 0.565471 0.133823 -0.784527 -0.175211 -0.642510 -0.793015 -0.413408 0.180634 0.275997 -0.764263 0.255788 0.223172 0.232877 0.238362 0.207036 0.215481 0.238286 0.222748 0.215926 0.279163 0.244961 0.230768 0.220278 0.229903 0.225824 0.256759 0.221341 0.237190 0.227885 0.247834 0.225652 0.235004 0.262950 0.252812 0.252466 0.273924 0.253109 0.248462 0.249506 0.250323
chargesum: 0.00000
title: Mulliken charges with hydrogens summed into heavy atoms:
elementType: O O O O C C C C C C C C C C C C C C C C C C C C C C C
charge: -0.295236 -0.200787 -0.252516 -0.235102 0.304797 0.111816 0.101467 0.117101 0.241881 -0.081170 -0.095309 -0.082311 0.007528 0.132301 -0.033178 -0.113054 -0.191150 0.565471 0.133823 -0.083155 0.059794 -0.379560 -0.013812 -0.160299 0.180634 0.275997 -0.015973
polarizability: 3.12614958e+02 3.36211140e+01 2.30913254e+02 1.64750605e+00 -3.36107528e+00 2.17518003e+02
1716.lowfreq: -12.4096 -9.8789 0.0004 0.0006 0.0007 4.5108 25.3236 34.7921 48.1356
frequency: 25.1613 34.7818 48.0876 55.4675 70.5679 82.3469 91.7372 97.8571 119.3033 127.9844 143.0381 149.0879 168.7203 177.4013 186.7483 200.5496 215.9502 224.7371 234.0315 249.8977 262.9639 273.1768 283.6724 294.6808 311.4495 340.3130 342.0782 347.1668 349.8937 379.1791 402.5810 421.0214 428.1937 449.7834 458.7971 478.3796 495.0661 499.7424 521.3164 534.3672 551.4580 565.2955 579.7381 588.4175 624.9910 651.3069 669.2865 680.6066 695.0624 697.2456 746.6809 765.0252 807.0093 816.7660 823.7548 837.0646 846.7498 875.6337 901.9278 906.2988 909.7615 924.8359 928.7468 931.8876 940.4830 953.1872 958.6743 977.6818 991.6796 994.5694 997.1592 1003.4083 1016.3536 1028.4960 1033.3675 1037.6834 1039.4199 1057.2834 1067.9834 1075.3701 1100.8625 1103.6509 1112.0441 1118.3369 1133.7746 1145.4882 1154.6558 1158.2055 1178.3814 1179.3966 1199.5501 1213.0243 1216.9738 1230.7252 1242.2052 1243.1519 1252.0167 1265.8687 1279.0553 1285.3300 1289.9331 1301.8613 1304.7830 1317.7124 1324.2443 1329.6994 1335.4133 1341.5780 1349.0146 1353.0509 1365.1268 1366.8755 1381.2437 1382.5505 1392.8518 1406.4525 1450.1579 1451.3243 1454.4683 1457.6080 1460.0685 1463.3099 1465.6382 1469.2946 1473.7164 1478.5542 1479.7405 1485.0056 1490.7942 1492.9522 1556.7916 1609.8281 1617.2684 1638.9982 1659.3504 2943.1399 2949.1891 2964.4254 2972.4163 2974.7879 2980.0078 2988.7495 2992.4801 2993.4949 2995.3671 2998.8342 3004.9643 3037.8404 3038.3474 3039.7495 3049.0017 3056.3820 3057.9578 3082.7289 3085.4201 3085.8683 3090.3768 3094.7958 3097.5792 3101.6365 3105.9727 3120.4234 3127.3222 3141.1122 3148.7750
redmass: 6.8316 4.1971 3.7864 1.5258 2.1623 3.1646 3.4131 5.4173 3.1180 2.1253 1.4926 2.2747 4.4102 5.5483 3.5905 1.7555 1.2919 2.2299 2.3535 2.5287 2.7216 3.2177 2.5654 2.6967 2.7886 3.6652 3.6625 3.9136 3.3964 3.1368 3.4012 3.5050 3.1322 2.6373 3.3018 4.0735 2.8587 3.5659 3.7594 2.8215 3.0979 3.3911 3.4738 3.5974 4.3581 3.2252 3.8031 3.6230 2.9952 2.6757 3.0466 3.1714 2.1706 2.2592 1.5533 2.0019 2.2520 2.7155 2.2126 2.5695 1.7044 2.5934 2.4740 2.4751 1.6930 2.0118 2.1945 2.1224 2.1648 1.8676 1.4221 2.0171 2.0975 2.2250 1.9914 2.1047 1.7179 2.6466 2.7717 3.1850 2.2393 1.9251 2.0524 2.2433 1.9461 1.6513 1.7410 2.1514 1.4975 2.1967 1.8572 1.8284 2.6525 1.5065 1.6886 1.6199 1.4092 1.6127 1.3886 1.3623 2.1463 1.3811 1.4178 1.3491 1.3717 1.3130 1.3896 1.4592 1.4332 2.0297 1.3995 1.2326 1.7153 1.2517 1.4045 1.1869 1.0663 1.0648 1.0502 1.0631 1.0684 1.0800 1.0912 1.0762 1.0752 1.0747 1.0680 1.0636 1.0775 1.0637 8.5663 8.5269 9.2182 9.3770 7.3247 1.0807 1.0800 1.0725 1.0685 1.0685 1.0610 1.0452 1.0486 1.0365 1.0596 1.0436 1.0377 1.0631 1.0976 1.0994 1.0989 1.1006 1.1007 1.0973 1.0946 1.0995 1.0997 1.0958 1.1014 1.0998 1.0857 1.1022 1.0918 1.1014 1.0976
irintensity: 3.2931 2.4391 0.4967 1.6040 0.6525 0.1125 0.6319 1.5401 5.2883 0.7013 1.8401 0.6555 0.4094 7.7996 0.8136 0.1125 0.1910 0.2223 1.7183 5.7379 0.7438 7.3459 0.4556 0.3587 0.2717 0.6647 1.5618 6.9302 1.8375 0.4804 2.1254 0.7672 1.5192 1.9365 5.9420 4.1835 5.0356 4.0956 1.3111 1.3886 1.1976 3.0227 14.9977 5.4408 2.0652 0.1397 4.9439 5.3622 9.8002 6.5916 0.4349 3.4383 7.2868 0.8304 15.0160 1.2771 5.8693 0.9071 0.8700 63.6650 28.1388 58.4858 9.6797 17.7378 6.6771 15.4828 0.8140 27.6011 11.7665 21.7524 7.0188 7.7158 3.8416 3.5300 3.1079 10.8227 5.9513 4.6203 6.1890 8.3874 10.9673 8.9647 7.5312 13.5819 6.0356 26.6520 6.8610 14.4657 29.8030 34.7553 108.4158 21.5540 193.7226 5.5772 26.4476 22.9987 7.3044 7.0761 5.4206 4.5185 17.3074 6.3219 1.1096 7.2863 0.0825 1.3076 2.3966 1.5063 6.5551 6.0298 11.7021 55.4933 23.9971 44.6881 11.7608 30.9094 10.3128 33.4395 19.7296 13.1905 4.3453 20.2626 6.2917 13.4553 13.7423 3.0588 11.5447 6.0883 9.0466 4.8693 185.7021 16.1708 88.7928 180.6287 160.9215 3.2224 1.0327 14.0719 13.5676 42.4712 32.6690 16.5154 30.4502 2.3131 32.8061 40.6122 1.9390 6.5951 39.3193 23.9583 28.6383 21.7340 47.8869 29.9709 5.0060 18.5605 28.1076 6.7281 26.4631 9.1634 14.7454 10.0433 10.5584 9.4587 15.3606
temp: 298.150 k
press: 1.00000 atm
elementType: 8 8 8 8 6 6 6 6 6 6 6 6 6 6 6 6 6 6 6 6 6 6 6 6 6 6 6 1 1 1 1 1 1 1 1 1 1 1 1 1 1 1 1 1 1 1 1 1 1 1 1 1 1 1 1 1 1
symmnumber: 1
zpe: 1258499.8 jmol-1
zpe.correction: 0.479337 hartree
zpe.thermalcorrener: 0.505759 hartree
zpe.thermalcorrenthalpy: 0.506703 hartree
zpe.thermalcorrgfe: 0.424014 hartree
zpe.sumelectzpe: -1193.295288 hartree
zpe.sumelectthermal: -1193.268867 hartree
zpe.sumelectthermalent: -1193.267923 hartree
zpe.sumelectthermalfe: -1193.350611 hartree
dipole: -1.4873 -1.0919 -0.8514
dipole: 2.0320
quadrupole: -230.9395 -162.7092 -149.2468
quadrupole: -32.8779 5.9347 -1.4006
quadrupole: -49.9743 18.2560 31.7183 -32.8779 5.9347 -1.4006
hfenergy: -1193.7746255 hartree
pointgroup: C01 [X(C23H30O4)]
dipole: 0.5669981 0.4792561 -0.2965753 debye
polarizability: 310.9939295|35.6459936|231.6371626|-0.0340547|4.0289041|218.4151227 unknown
InChI: InChI=1S/C23H30O4/c1-14(24)23(27-15(2)25)12-9-20-18-6-5-16-13-17(26)7-10-21(16,3)19(18)8-11-22(20,23)4/h7,10,13,18-20H,5-6,8-9,11-12H2,1-4H3
charge 0 multiplicity 1
57 atoms
O  2.871811 -1.186892 -0.262726
O  4.671407 1.973916 -0.372499
O  -6.160881 -2.290446 -0.278293
O  5.100044 -1.547552 0.337448
C  1.527396 0.860707 -0.309285
C  0.734185 0.329948 0.931717
C  -0.74672 0.766174 0.94814
C  -1.425061 0.24396 -0.36189
C  2.968738 0.290369 0.038631
C  0.85322 0.325353 -1.594513
C  1.642584 0.688278 2.132628
C  -0.652731 0.709987 -1.628045
C  3.094428 0.519594 1.576568
C  -2.987935 0.576944 -0.408608
C  -1.472605 0.237021 2.205929
C  1.610682 2.412279 -0.351209
C  -2.988532 0.570596 2.177578
C  -3.609344 0.062465 0.893067
C  4.100339 0.935234 -0.79563
C  -3.24469 2.120562 -0.532568
C  -3.61488 -0.063998 -1.633915
C  -4.624871 -0.856716 0.908011
C  4.440668 0.34252 -2.155251
C  -4.629298 -0.973528 -1.599484
C  -5.211353 -1.437822 -0.317066
C  3.985133 -1.996099 -0.014321
C  3.633128 -3.452297 -0.224729
H  0.736045 -0.778269 0.840482
H  -0.796109 1.874981 0.967346
H  -1.361854 -0.866981 -0.327412
H  0.951989 -0.775335 -1.6276
H  1.344751 0.731501 -2.500537
H  1.461486 0.034615 3.003284
H  1.46569 1.729517 2.462802
H  -0.752031 1.80562 -1.749684
H  -1.098586 0.25045 -2.52912
H  3.716586 1.414503 1.744516
H  3.626343 -0.326903 2.039477
H  -1.016439 0.669612 3.116223
H  -1.344245 -0.863374 2.267269
H  2.103219 2.749919 -1.280693
H  0.606231 2.866423 -0.32707
H  2.191373 2.828849 0.487993
H  -3.110324 1.670102 2.258986
H  -3.497743 0.123458 3.050093
H  -2.889605 2.501747 -1.506027
H  -4.326814 2.328614 -0.464569
H  -2.734611 2.689912 0.263091
H  -3.232001 0.278264 -2.604799
H  -5.045154 -1.214151 1.856548
H  3.599258 -0.214974 -2.597365
H  4.769888 1.149998 -2.829512
H  5.288425 -0.357448 -2.032498
H  -5.06357 -1.392638 -2.514784
H  3.046039 -3.583453 -1.148659
H  3.010221 -3.809443 0.615533
H  4.552383 -4.054276 -0.267699
