program: Gaussian 09
title: 000200625
version: EM64L-G09RevD.01
frameworkgroup: C1[X(C10H14ClO3P)]
method: RPBEPBE
basis: SDD
operation: Freq
keyword: #p
keyword: freq=noraman
keyword: PBEPBE/SDD
title: #p freq=noraman PBEPBE/SDD
converged: YES YES NO NO
title: Mulliken charges:
elementType: Cl P O O O C C C C C C C C C C H H H H H H H H H H H H H H
charge: -0.041844 1.266731 -0.518881 -0.504228 -0.623641 -0.171375 -0.287896 -0.221517 -0.226858 -0.258244 -0.190855 -0.195026 -0.096050 -0.646238 -0.647115 0.289883 0.272603 0.228797 0.220175 0.220899 0.242547 0.264601 0.263690 0.207225 0.251181 0.226156 0.214793 0.230391 0.230097
chargesum: 0.00000
title: Mulliken charges with hydrogens summed into heavy atoms:
elementType: Cl P O O O C C C C C C C C C C
charge: -0.041844 1.266731 -0.518881 -0.504228 -0.623641 -0.171375 0.001987 0.051086 0.222114 0.205202 0.073746 0.068664 -0.096050 0.038323 0.028166
polarizability: 2.09210189e+02 1.46117233e+00 1.23740780e+02 -1.79297961e+00 1.58014770e+01 1.21821592e+02
1716.lowfreq: -14.3138 -13.9511 -7.0170 -0.0014 -0.0010 0.0010 12.4444 21.0085 26.5673
frequency: 3.3120 20.4925 26.2518 32.4255 57.1973 69.3250 90.7331 129.4742 158.5118 177.8164 204.2662 225.0994 237.6489 249.8710 265.9504 309.8409 355.2416 368.2732 401.8964 404.7102 424.6320 433.1091 501.0872 524.5650 612.0299 625.7388 660.6290 716.7356 730.2234 796.0644 800.4643 829.2054 842.3592 855.6905 876.5554 955.2781 978.1726 997.4865 1009.3776 1018.5708 1022.2028 1068.7655 1088.5715 1096.1012 1103.0220 1108.5922 1140.7602 1149.0366 1185.4593 1264.4385 1272.1517 1291.2219 1348.0173 1351.8599 1367.0621 1386.9521 1387.5818 1388.6499 1456.2033 1460.6322 1462.6790 1463.7407 1475.0577 1477.1597 1488.8850 1581.0843 1584.4193 2985.3589 2988.6247 3000.5267 3009.5534 3072.6240 3072.9733 3083.5012 3085.3161 3104.4480 3112.7510 3147.6596 3159.0611 3176.4677 3180.0921
redmass: 2.8552 3.4604 3.2584 2.8701 4.8936 2.9629 6.2318 4.7448 4.7528 2.1834 2.3497 5.6305 1.5666 1.6372 6.8622 5.5689 4.5239 4.6193 3.0123 4.8100 5.5761 4.0114 3.1790 8.5450 7.4663 7.7196 6.1402 4.0375 7.1807 1.1224 1.1164 1.3856 1.3152 3.4706 3.4741 1.3499 1.3532 5.3124 2.9835 3.2120 8.5772 3.3095 2.1568 2.1628 3.0241 1.4027 1.5628 1.5675 1.1311 1.1199 1.1114 1.2396 1.2219 1.2342 4.4292 3.5548 1.2706 1.2602 1.0406 1.0738 1.9182 1.1147 1.0684 1.0570 1.0605 7.7753 6.0924 1.0359 1.0367 1.0619 1.0602 1.1025 1.1031 1.0990 1.0975 1.1041 1.1025 1.0905 1.0892 1.0959 1.0977
irintensity: 0.8852 0.3921 0.5327 0.5417 0.3821 0.7820 2.0336 4.4290 4.4950 10.5400 4.3018 3.7785 3.3464 4.0849 4.7808 2.0008 2.9602 1.9831 1.1984 19.3828 59.6891 4.9111 31.3740 14.9955 42.6363 46.1559 127.5910 28.3923 93.6203 3.6183 4.5823 23.1464 13.3413 130.6409 173.4302 0.3888 0.0763 56.4392 138.5355 124.1983 118.0012 53.6858 11.7801 12.5850 35.5491 2.2361 4.8334 10.6318 2.5286 0.3576 0.2040 1.5120 14.0201 10.8826 4.1257 6.2642 36.6153 24.0699 10.0972 15.1948 48.4966 0.5950 1.9893 13.5168 10.3827 5.4336 51.8798 17.0340 21.8033 34.2311 36.0126 7.3836 13.1505 35.4006 37.7582 32.7415 32.0070 0.5569 0.2401 1.9686 1.8282
temp: 298.150 k
press: 1.00000 atm
elementType: 17 15 8 8 8 6 6 6 6 6 6 6 6 6 6 1 1 1 1 1 1 1 1 1 1 1 1 1 1
symmnumber: 1
zpe: 583930.6 jmol-1
zpe.correction: 0.222407 hartree
zpe.thermalcorrener: 0.239949 hartree
zpe.thermalcorrenthalpy: 0.240893 hartree
zpe.thermalcorrgfe: 0.171291 hartree
zpe.sumelectzpe: -1415.259994 hartree
zpe.sumelectthermal: -1415.242452 hartree
zpe.sumelectthermalent: -1415.241508 hartree
zpe.sumelectthermalfe: -1415.311110 hartree
dipole: -1.2127 0.3548 -2.0941
dipole: 2.4458
quadrupole: -100.3981 -97.1975 -106.9759
quadrupole: 3.0823 6.0457 0.3127
quadrupole: 1.1258 4.3264 -5.4521 3.0823 6.0457 0.3127
hfenergy: -1415.4824012 hartree
pointgroup: C01 [X(C10H14Cl1O3P1)]
dipole: -0.586338 -0.0086222 -0.7629284 debye
polarizability: 190.0870067|36.1505732|138.1792204|-13.4247042|10.6457554|126.506333 unknown
InChI: InChI=1S/C10H14ClO3P/c1-3-13-15(12,14-4-2)10-7-5-9(11)6-8-10/h5-8H,3-4H2,1-2H3
charge 0 multiplicity 1
29 atoms
Cl 4.788241 1.929733 -0.794237
P  -1.000356 -0.53703 0.622787
O  -0.782014 -2.194471 0.205912
O  -2.130716 -0.054383 -0.626749
O  -1.51842 -0.172096 2.088842
C  0.659898 0.132193 0.190609
C  1.290948 0.982689 1.126748
C  1.279889 -0.180543 -1.040698
C  -1.9339 -3.13805 0.33736
C  -3.125172 1.008442 -0.29115
C  2.555521 1.536011 0.829585
C  2.544767 0.366983 -1.344752
C  3.158533 1.218752 -0.4035
C  -2.535937 -3.431385 -1.037875
C  -2.553461 2.409923 -0.526694
H  0.799659 1.20171 2.081057
H  0.788154 -0.850453 -1.752248
H  -1.494328 -4.040112 0.795683
H  -2.683352 -2.717566 1.035492
H  -3.967757 0.795188 -0.970303
H  -3.452918 0.877267 0.757242
H  3.060223 2.194522 1.54158
H  3.042277 0.135106 -2.29036
H  -3.349727 -4.17534 -0.941932
H  -2.943705 -2.509491 -1.48482
H  -1.769206 -3.843633 -1.716336
H  -3.345895 3.167992 -0.379698
H  -1.735937 2.63434 0.181653
H  -2.165507 2.507204 -1.555295
