program: Gaussian 09
title: 000200678
version: EM64L-G09RevD.01
frameworkgroup: C1[X(C20H23Cl2NO2)]
method: RPBEPBE
basis: SDD
operation: Freq
keyword: #p
keyword: freq=noraman
keyword: PBEPBE/SDD
title: #p freq=noraman PBEPBE/SDD
converged: YES YES NO NO
title: Mulliken charges:
elementType: Cl Cl O O N C C C C C C C C C C C C C C C C C C C C H H H H H H H H H H H H H H H H H H H H H H H
charge: -0.088481 -0.062469 -0.478260 -0.246132 -0.090323 0.185387 -0.467694 -0.364693 -0.687424 -0.329008 -0.344925 0.401413 -0.326568 -0.320927 0.668818 -0.406609 -0.370937 -0.354248 -0.379740 -0.236836 -0.210757 -0.114344 -0.240204 -0.236842 -0.230090 0.203686 0.225609 0.203985 0.244900 0.231653 0.249574 0.206684 0.189843 0.191263 0.213575 0.212943 0.190078 0.191582 0.213590 0.346687 0.232349 0.296272 0.250680 0.254606 0.254623 0.256311 0.234486 0.236915
chargesum: 0.00000
title: Mulliken charges with hydrogens summed into heavy atoms:
elementType: Cl Cl O O N C C C C C C C C C C C C C C C C C C C C
charge: -0.088481 -0.062469 -0.131573 -0.246132 -0.090323 0.185387 -0.038399 0.084192 -0.206197 0.067519 0.059913 0.401413 0.076453 0.084244 0.668818 -0.174260 -0.074665 -0.354248 -0.129060 0.017769 0.043866 -0.114344 0.016107 -0.002356 0.006824
polarizability: 2.63750937e+02 -2.10834185e+01 2.73126340e+02 1.54611150e+01 1.57213073e+01 1.85622045e+02
1716.lowfreq: -7.2415 -3.9411 -0.0013 -0.0008 0.0004 2.5921 15.4909 19.0094 21.7056
frequency: 14.8197 18.8642 21.5803 35.3982 36.8033 50.7420 73.8569 86.2899 108.1539 135.7604 141.3057 158.2767 170.4432 196.6266 222.5521 236.7410 255.1688 271.0961 290.5940 296.8013 311.5607 340.0656 360.4148 385.2086 392.9270 407.6770 409.8465 418.9916 432.9426 438.4843 443.2190 466.3804 472.4550 495.4961 510.4374 564.1887 595.4486 600.0913 625.7292 642.6618 661.9457 712.6426 726.1052 739.6404 762.2243 771.3054 790.6902 808.2441 819.6985 825.8456 840.1228 842.2842 865.4520 869.9888 902.0198 947.6588 950.0103 956.1061 977.1768 987.7154 988.4759 998.9327 1009.9018 1017.0844 1027.9963 1038.1233 1052.0046 1054.3100 1067.7034 1072.6920 1077.0279 1094.8386 1104.5567 1112.5810 1122.5670 1130.6965 1152.3867 1162.5028 1170.6025 1181.7757 1187.2732 1189.2687 1204.7644 1215.0679 1243.6295 1265.5081 1286.0646 1289.0957 1290.5870 1291.3293 1298.6977 1316.9369 1331.1795 1344.4531 1360.6354 1364.5724 1370.9547 1371.8831 1382.1334 1388.8265 1395.5650 1426.2470 1442.5545 1447.2306 1450.6505 1457.9250 1459.0093 1464.3380 1470.3652 1477.8219 1484.4397 1572.6459 1584.4002 1599.2738 1609.0924 2852.8067 2862.6513 2877.0506 2952.2623 2957.1809 2979.0734 3001.4876 3027.2207 3028.6196 3033.2758 3045.5092 3060.4815 3078.4280 3082.4601 3122.7232 3133.1641 3145.1753 3160.8655 3162.0466 3167.1942 3176.8870 3187.5819 3520.7420
redmass: 3.2599 6.2255 7.2467 4.3259 6.8519 5.2947 4.8983 5.0305 5.7680 8.0197 4.9581 4.9620 3.6413 6.0823 3.3217 1.8047 4.8995 5.5159 5.1695 5.2184 2.4277 5.0564 4.4726 1.7858 1.3668 2.9021 2.7690 4.3130 4.1278 3.9114 2.7491 3.0671 3.4030 4.0452 3.7387 3.8516 3.2816 2.6156 7.1367 3.5737 5.7723 4.4178 4.1201 3.1081 1.4717 2.8231 1.4630 3.7598 3.9836 1.4341 1.6142 1.4076 2.1288 1.5790 2.3372 1.4001 1.3672 2.0374 1.8739 1.3710 1.8425 4.2349 6.2013 2.8550 2.1761 2.1505 2.3453 2.8603 2.4371 2.7740 2.9026 3.4074 1.9295 1.5546 1.6929 2.4664 2.3625 1.9241 1.1174 1.1561 1.1784 1.0844 1.2433 2.3220 1.2664 1.2906 1.4098 1.2611 1.2674 1.2856 1.4021 1.3733 1.2829 1.2753 2.8851 1.5101 1.3567 3.9646 2.6386 3.5097 1.4386 2.1844 1.0828 1.0800 1.0969 1.0961 1.1013 2.4796 1.1956 2.0274 1.1144 5.9953 7.7504 6.2854 7.2887 1.0708 1.0700 1.0692 1.0665 1.0665 1.0592 1.0593 1.0928 1.0889 1.0891 1.0973 1.1016 1.0962 1.0978 1.0892 1.0868 1.0902 1.0903 1.0953 1.0951 1.0994 1.0949 1.0662
irintensity: 0.0596 0.0448 0.1219 0.2392 0.6154 0.5344 1.1213 1.4579 0.2351 1.1787 0.5710 1.0691 4.7384 1.7522 9.1995 1.9857 3.9683 2.5654 4.0052 3.4889 16.8226 4.1083 9.3563 99.8918 152.5347 2.0806 9.1564 9.2405 4.8995 3.7532 14.8790 4.4532 3.6558 13.3839 7.7460 13.9370 5.1750 2.1762 0.2494 18.0663 16.4194 5.4649 20.6600 37.0477 55.3381 8.9304 2.4955 28.1867 3.2809 30.1398 0.3825 30.6254 21.4089 4.1128 8.5900 0.8647 1.8648 27.8004 12.3194 0.4833 7.7950 54.5792 41.1011 8.2664 8.2198 4.4783 31.0988 2.0712 30.1785 38.1780 11.3641 31.2322 4.5712 8.9381 10.6628 73.0313 8.8148 19.6518 7.0981 1.6293 6.7379 0.6790 11.7848 0.4926 23.5175 6.5265 0.8683 7.3229 3.3273 5.0353 22.7735 11.6834 4.2527 6.9775 6.2866 2.0560 3.9812 8.1249 16.7220 9.8622 4.2564 22.2366 2.4499 1.2530 20.8293 1.8918 4.6474 35.0587 14.0708 48.2107 24.0997 9.2271 2.6362 9.7102 1.0362 49.1586 39.3821 142.3876 35.8045 102.2370 15.4295 22.5612 16.1776 40.3600 27.4947 28.4951 19.1513 40.7911 37.1821 12.5598 1.9645 10.6031 2.1443 12.6395 3.4403 11.0252 1.4261 59.3928
temp: 298.150 k
press: 1.00000 atm
elementType: 17 17 8 8 7 6 6 6 6 6 6 6 6 6 6 6 6 6 6 6 6 6 6 6 6 1 1 1 1 1 1 1 1 1 1 1 1 1 1 1 1 1 1 1 1 1 1 1
symmnumber: 1
zpe: 1013709.8 jmol-1
zpe.correction: 0.386102 hartree
zpe.thermalcorrener: 0.409935 hartree
zpe.thermalcorrenthalpy: 0.410879 hartree
zpe.thermalcorrgfe: 0.329108 hartree
zpe.sumelectzpe: -1899.360883 hartree
zpe.sumelectthermal: -1899.337049 hartree
zpe.sumelectthermalent: -1899.336105 hartree
zpe.sumelectthermalfe: -1899.417877 hartree
dipole: -2.5313 -1.6196 1.4536
dipole: 3.3381
quadrupole: -170.8584 -174.9685 -153.2233
quadrupole: 2.5699 0.8931 3.6728
quadrupole: -4.5083 -8.6184 13.1268 2.5699 0.8931 3.6728
hfenergy: -1899.7469845 hartree
pointgroup: C01 [X(C20H23Cl2N1O2)]
dipole: 1.0297987 -0.5554823 -0.5964787 debye
polarizability: 261.4139804|19.7186134|276.5577491|16.9032148|-11.3700322|184.5275921 unknown
InChI: InChI=1S/C20H23Cl2NO2/c21-18-7-5-17(6-8-18)20(24,9-10-23-11-13-25-14-12-23)15-16-3-1-2-4-19(16)22/h1-8,24H,9-15H2
charge 0 multiplicity 1
48 atoms
Cl 2.061421 -3.84772 0.284906
Cl 1.500934 5.503689 0.499071
O  0.398658 -1.123017 1.212525
O  -6.557771 -0.723724 -0.151163
N  -3.664274 -0.747795 0.182434
C  0.199434 -0.510351 -0.112762
C  -1.268071 -0.763404 -0.571849
C  -2.313351 -0.169049 0.392623
C  1.169445 -1.166227 -1.168589
C  -4.292744 -0.324787 -1.096714
C  -4.575702 -0.442807 1.317501
C  0.508174 0.984772 0.054441
C  -5.652471 -1.020934 -1.272941
C  -5.926821 -1.144363 1.112439
C  2.616204 -1.263047 -0.724027
C  0.260511 1.890289 -1.00942
C  1.060381 1.484662 1.257172
C  3.150385 -2.394081 -0.063064
C  3.52098 -0.191578 -0.956946
C  0.560015 3.264103 -0.884635
C  1.363668 2.857969 1.402831
C  1.110107 3.727294 0.326718
C  4.490547 -2.495242 0.351339
C  4.870636 -0.255034 -0.550957
C  5.359324 -1.408327 0.103646
H  -1.402159 -0.37116 -1.598629
H  -1.433809 -1.85817 -0.619538
H  -2.3239 0.946137 0.308589
H  -1.997602 -0.417653 1.422811
H  1.10834 -0.572802 -2.098629
H  0.777887 -2.17515 -1.398592
H  -3.636242 -0.605698 -1.940958
H  -4.440405 0.785611 -1.128517
H  -4.749597 0.658368 1.421303
H  -4.111204 -0.804296 2.254435
H  -6.172149 -0.656644 -2.17476
H  -5.497289 -2.119243 -1.34744
H  -5.77652 -2.245629 1.105487
H  -6.643476 -0.871251 1.904604
H  0.461036 -2.108266 1.107467
H  -0.174925 1.536495 -1.951714
H  1.248979 0.786415 2.075772
H  3.144432 0.704842 -1.462353
H  0.366082 3.958251 -1.70744
H  1.790408 3.238955 2.335343
H  4.846858 -3.397661 0.855965
H  5.538223 0.590736 -0.745407
H  6.405712 -1.470079 0.420323
