program: Gaussian 09
title: 000200610
version: EM64L-G09RevD.01
frameworkgroup: C1[X(C11H10BrNO2)]
method: RPBEPBE
basis: SDD
operation: Freq
keyword: #p
keyword: freq=noraman
keyword: PBEPBE/SDD
title: #p freq=noraman PBEPBE/SDD
converged: YES YES NO NO
title: Mulliken charges:
elementType: Br O O N C C C C C C C C C C C H H H H H H H H H H
charge: 0.016567 -0.188719 -0.207963 -0.158467 -0.380637 -0.554607 0.149675 0.569763 0.177087 -0.602782 -0.441234 -0.370999 -0.167285 -0.184880 -0.225553 0.269698 0.271563 0.278922 0.238468 0.236409 0.253450 0.253936 0.262788 0.253333 0.251466
chargesum: 0.00000
title: Mulliken charges with hydrogens summed into heavy atoms:
elementType: Br O O N C C C C C C C C C C C
charge: 0.016567 -0.188719 -0.207963 -0.158467 -0.110938 -0.004122 0.149675 0.569763 0.177087 0.167391 -0.202766 -0.134590 0.086048 0.066587 -0.225553
polarizability: 2.11999330e+02 1.04116349e+01 1.07248742e+02 3.83894679e-01 9.06657655e+00 1.11443863e+02
1716.lowfreq: -15.4719 -9.9130 -4.3983 -2.3663 0.0002 0.0003 0.0005 25.3900 47.6718
frequency: -14.0538 25.3566 47.6577 71.7261 113.9775 127.8747 158.4502 198.0646 234.9082 268.3829 280.7380 318.5309 348.9789 385.6427 405.2053 497.7550 530.5599 545.5539 578.0743 602.4062 623.9996 657.5732 674.3433 718.4936 770.7723 794.3098 830.4081 838.4588 935.9110 953.2356 956.3464 968.4994 996.5878 1034.6802 1049.9090 1063.2839 1108.3464 1111.3786 1128.1396 1155.3580 1190.5476 1209.6652 1230.4610 1259.4276 1270.5400 1280.7815 1306.9952 1347.7285 1377.2623 1398.8205 1433.2518 1448.5426 1471.2595 1474.3968 1481.4965 1582.8256 1598.7506 1631.3695 1696.5394 3006.4579 3020.3649 3029.8451 3088.0948 3100.0000 3123.7537 3125.3402 3134.2417 3168.7746 3173.0819
redmass: 4.7662 5.8137 5.7898 1.0588 5.6417 7.2869 4.9902 7.9936 3.4416 3.1878 4.7473 6.6879 8.1127 6.3197 2.8562 3.3870 4.4479 2.8510 10.1394 3.7295 6.8264 6.3728 5.6620 3.6213 3.5781 3.9494 1.2524 1.7747 2.3663 1.7346 1.7316 1.3877 4.8737 3.5912 6.1165 2.4954 2.8048 1.4480 1.3304 1.2283 1.1107 1.8650 1.3687 2.8812 1.4805 1.7715 1.4928 5.4102 6.2814 2.3185 1.2334 1.0910 1.0436 2.4154 1.0707 7.1317 6.2733 12.0122 11.2495 1.0328 1.0822 1.0634 1.1015 1.1021 1.0900 1.1024 1.0901 1.0949 1.0958
irintensity: 0.0333 0.1536 0.0088 0.3022 10.6940 0.9063 1.9270 1.4804 1.1591 5.4457 1.6101 5.9859 20.2781 10.1461 0.0175 23.2627 2.9961 0.9764 5.5456 11.4678 0.8433 16.0348 16.8497 3.5232 10.3038 20.7800 0.1541 42.8427 32.9226 11.6873 6.1795 0.4758 53.0575 38.8204 13.0761 28.9967 106.6136 19.9402 0.4442 8.1947 0.2965 2.8626 15.8193 94.5165 14.9247 0.0892 0.5794 146.3919 0.0977 10.3790 82.9319 9.1641 17.7607 81.6922 14.1314 0.9967 25.8287 578.8134 40.2510 23.0621 8.0389 5.2022 5.2714 14.6449 11.8469 0.7071 9.8198 5.9276 1.6802
temp: 298.150 k
press: 1.00000 atm
elementType: 35 8 8 7 6 6 6 6 6 6 6 6 6 6 6 1 1 1 1 1 1 1 1 1 1
symmnumber: 1
zpe: 489096.2 jmol-1
zpe.correction: 0.186287 hartree
zpe.thermalcorrener: 0.199344 hartree
zpe.thermalcorrenthalpy: 0.200289 hartree
zpe.thermalcorrgfe: 0.144215 hartree
zpe.sumelectzpe: -642.783374 hartree
zpe.sumelectthermal: -642.770317 hartree
zpe.sumelectthermalent: -642.769373 hartree
zpe.sumelectthermalfe: -642.825446 hartree
dipole: -0.7195 -0.3789 1.3302
dipole: 1.5591
quadrupole: -105.6257 -109.0048 -85.9058
quadrupole: -7.3252 0.7495 2.7038
quadrupole: -5.4469 -8.8261 14.2730 -7.3252 0.7495 2.7038
hfenergy: -642.9696612 hartree
pointgroup: C01 [X(C11H10Br1N1O2)]
dipole: 0.2596583 -0.4634478 -0.3066367 debye
dipolederiv: -0.7435114 0.0876142 0.1418298 0.099003 -0.0487481 -0.0282458 0.1658422 -0.0291129 -0.0977987 -0.5792535 0.0477162 -0.1095557 0.0895341 -0.8935936 0.3833677 -0.1877466 0.250591 -0.5225453 -0.9331924 0.3085837 -0.3323565 0.1368307 -0.6538188 0.180575 -0.4046348 0.3004674 -0.5984385 -0.9906946 0.1982529 -0.414782 0.1697103 -1.0683035 0.4533147 -0.5575744 0.4409353 -0.583034 -0.1526792 -0.1683747 -0.0354774 -0.2322267 -0.1265252 0.0367237 -0.1673598 -0.0078155 0.1400362 -0.317774 -0.1428398 -0.0980545 -0.2561968 -0.0844738 -0.0048284 -0.0359631 -0.0072899 0.0356461 1.2479258 -0.2527328 0.5783698 0.1540724 1.0041275 -0.4675793 0.7196234 -0.4604477 0.6738613 0.4205203 0.0168104 -0.0403992 -0.0501956 -0.0670727 -0.0061044 -0.0652467 0.0037404 -0.0582405 0.9996284 -0.1629227 0.4144221 -0.2279695 1.4021031 -0.5755048 0.5669233 -0.5453138 0.619265 0.2624077 0.1610218 -0.0352447 0.1487179 0.2067945 0.0572371 -0.0394498 0.0987179 0.1621421 -0.0636919 -0.0217505 -0.047804 0.0132081 -0.1173721 0.0391015 0.0599932 0.0516769 0.0717343 -0.0606028 0.0009814 0.0537162 0.0025068 -0.110116 0.0419644 0.0132391 0.0433072 0.0132345 -0.3342626 0.064334 0.1918107 0.0565109 -0.0805897 -0.005882 0.1487302 0.0013116 -0.036217 -0.3994136 0.0237652 0.0046725 0.0401201 -0.0767253 0.0391016 0.0553721 0.0322121 0.035476 1.2807437 -0.1815308 -0.2817706 -0.1978797 -0.096875 0.079911 -0.308352 0.076703 0.0790082 0.057735 -0.0052786 -0.0382189 -0.0006106 0.0512881 -0.0284241 0.0312956 -0.0215133 -0.0714566 0.0325459 0.0495603 -0.0017321 0.0714425 -0.0096557 -0.0410221 -0.0080158 -0.0844823 0.0636722 0.0668414 -0.0502138 0.054626 -0.0445983 0.1040411 0.0111958 0.0579252 0.0436024 -0.0079134 0.0442727 0.0336563 0.0796565 0.0270226 0.1248115 -0.0550881 0.0593187 -0.0585828 -0.0510164 -0.046244 -0.0095631 -0.0909545 -0.0134708 0.1220901 -0.0223152 -0.1070885 -0.0240536 0.0232549 0.033942 0.0559168 0.0717053 -0.0144723 -0.0324841 -0.0823485 0.0242578 -0.0785467 0.0569462 0.0598553 -0.0532659 0.022427 -0.0735236 0.0539754 0.0176233 0.100286 0.0491509 -0.047209 0.0321847 -0.0039569 -0.0466642 0.0879371 0.1044117 0.0570467 -0.0874249 0.0040938 0.0816562 0.0062462 -0.0114472 -0.0772429 -0.005029 0.1519573 -0.0272589 -0.0761272 -0.0274183 0.0386355 0.076471 0.0156636 0.0370215 0.0195568 0.1407531 -0.0525606 0.0421766 -0.0519332 -0.0206992 unknown
polarizability: 212.0879407|-9.8865643|100.457366|2.9306841|1.2204447|118.1466283 unknown
InChI: InChI=1S/C11H10BrNO2/c1-13-10(14)6-9(11(13)15)7-2-4-8(12)5-3-7/h2-5,9H,6H2,1H3
charge 0 multiplicity 1
25 atoms
Br -5.350148 0.348447 0.711571
O  1.304037 1.860305 -1.249415
O  3.666874 -1.275401 1.303602
N  2.686236 0.503142 0.093921
C  0.717424 -0.545759 -0.79558
C  1.490134 -1.556134 0.100906
C  1.550138 0.759747 -0.706301
C  -0.746958 -0.328751 -0.428278
C  2.741805 -0.823523 0.589291
C  3.717697 1.511958 0.365953
C  -1.76477 -0.509415 -1.393896
C  -1.118244 0.065248 0.882977
C  -3.126254 -0.312949 -1.068438
C  -2.471412 0.267332 1.22804
C  -3.463107 0.07246 0.243676
H  0.764009 -0.86369 -1.853794
H  1.790853 -2.469865 -0.438659
H  0.899036 -1.881044 0.974472
H  -1.500145 -0.801641 -2.416727
H  -0.350485 0.227198 1.649841
H  3.283515 2.366498 0.911526
H  4.14494 1.88333 -0.580291
H  4.501398 1.03453 0.975196
H  -3.904027 -0.456319 -1.823608
H  -2.747444 0.5742 2.240914
