program: Gaussian 09
title: 000200669
version: EM64L-G09RevD.01
frameworkgroup: C1[X(C20H23NO2)]
method: RPBEPBE
basis: SDD
operation: Freq
keyword: #p
keyword: freq=noraman
keyword: PBEPBE/SDD
title: #p freq=noraman PBEPBE/SDD
converged: YES YES NO NO
title: Mulliken charges:
elementType: O O N C C C C C C C C C C C C C C C C C C C C H H H H H H H H H H H H H H H H H H H H H H H
charge: -0.318034 -0.302015 -0.133256 -0.160544 0.050213 -0.665518 -0.392709 0.419748 -0.565696 0.137577 0.378920 0.124628 -0.308973 0.009331 -0.623678 0.220981 -0.461967 -0.363118 -0.691504 -0.244187 -0.264639 -0.526482 -0.526913 0.211324 0.220028 0.245446 0.209957 0.192418 0.237646 0.211275 0.187313 0.202943 0.259687 0.235319 0.288208 0.229630 0.211051 0.208464 0.224793 0.225487 0.254562 0.225107 0.228381 0.254104 0.226011 0.218679
chargesum: 0.00000
title: Mulliken charges with hydrogens summed into heavy atoms:
elementType: O O N C C C C C C C C C C C C C C C C C C C C
charge: -0.318034 -0.302015 -0.133256 0.050780 0.050213 -0.200044 0.009666 0.419748 -0.116775 0.137577 0.378920 0.124628 0.081283 0.009331 -0.363991 0.220981 -0.226647 -0.074910 -0.042360 -0.019394 -0.039152 0.181568 0.171882
polarizability: 2.80876365e+02 2.53507149e+00 2.89157698e+02 9.33023355e+00 -3.20013367e+00 1.35163391e+02
1716.lowfreq: -8.0631 -5.7442 -0.0007 -0.0004 0.0005 7.5060 35.7599 53.1872 56.4309
frequency: 35.6977 53.1748 56.4145 66.8044 79.3448 94.3888 113.4597 130.4436 151.6195 161.5782 168.5719 173.3615 200.0678 223.3325 237.7458 252.8539 272.9228 284.1628 303.7430 319.4442 335.8128 357.8268 374.9277 381.2064 417.0901 443.8251 449.8871 462.4261 508.5043 516.5154 536.7942 537.0471 592.7053 613.4838 640.1317 659.7122 684.4311 702.5857 738.9521 753.0596 760.9977 784.4043 791.2835 795.5649 822.3086 859.2265 880.3348 886.8712 903.6200 927.8270 945.4765 952.5395 964.5381 982.3992 988.6424 1002.0795 1033.6055 1042.1037 1069.2314 1074.2963 1084.8707 1096.9694 1107.3843 1109.8639 1111.8859 1123.8669 1149.5429 1151.9880 1155.9451 1160.4305 1175.3154 1179.0527 1192.4727 1214.8587 1218.9115 1221.0697 1253.4633 1264.6591 1291.2078 1294.9357 1299.7222 1311.9534 1322.0146 1342.7623 1359.3373 1366.1852 1375.3042 1384.7577 1388.0162 1402.0115 1411.7765 1431.6394 1440.1691 1445.5295 1453.1886 1455.1563 1457.4483 1460.1777 1465.6858 1473.0722 1477.2737 1478.1574 1485.6686 1487.2305 1490.3892 1577.3255 1578.4802 1597.0517 1611.9004 2791.5661 2844.1755 2857.3602 2970.2349 2973.9315 2980.0371 2980.4826 2985.6150 3035.6107 3044.6816 3050.2705 3057.3223 3069.1871 3073.6708 3078.9775 3093.0265 3115.8363 3117.4563 3118.6857 3130.8534 3144.4955 3153.4560 3189.2158
redmass: 3.5446 3.1737 2.3735 3.0521 3.5892 2.8399 3.6959 2.8507 2.0204 1.2420 1.2832 1.7052 2.3788 2.5552 3.6123 2.7846 3.4412 3.7619 3.6710 3.2426 5.6765 3.4683 3.9526 5.0056 5.1612 3.1713 3.3025 3.7213 3.9312 3.4655 3.4308 3.8959 4.4443 4.2690 6.0066 4.5974 5.0192 3.7267 2.9140 2.5367 1.9197 3.3314 1.5255 3.2310 2.2003 3.4907 1.5951 1.5360 4.8831 2.5916 2.8192 1.4724 2.9485 2.6188 1.3280 3.2339 2.1728 2.3402 2.8485 2.9798 2.3616 3.1428 1.9750 1.2465 1.2436 2.0311 1.5385 1.4549 1.3360 1.7336 1.1181 1.5932 1.8360 2.0329 2.0395 1.8688 1.3781 1.5726 1.8448 1.3497 1.5462 1.6155 1.9311 1.9930 2.0917 2.3371 3.3804 1.5832 1.2491 2.5775 1.5979 1.7089 1.4987 1.2309 1.1229 1.9283 1.0971 1.1681 1.0556 1.0668 1.0571 1.0949 1.0553 2.6794 1.0720 6.5476 8.8312 7.4086 6.5939 1.0783 1.0724 1.0715 1.0315 1.0299 1.0633 1.0608 1.0358 1.1001 1.0886 1.0879 1.0949 1.1024 1.1048 1.0973 1.1002 1.0865 1.1031 1.1030 1.0902 1.0919 1.0982 1.0944
irintensity: 0.3327 0.2453 1.1848 2.2915 1.2306 6.3672 1.2360 4.1090 1.1307 0.1026 0.4917 1.7671 0.4899 1.4317 3.6955 2.9053 8.1429 0.8971 11.2853 1.0929 3.6482 1.6900 1.0052 0.9464 2.2177 0.8458 4.3896 1.3263 0.9972 2.0556 16.5229 0.9202 1.3794 8.7005 10.9895 3.4581 6.3099 1.4211 6.6936 11.8513 50.8433 8.6570 6.8252 15.7201 6.0931 6.5078 0.2479 15.9254 17.4783 18.8886 38.3761 1.1216 34.7434 55.6076 0.7674 10.2478 3.3769 7.0042 25.9273 16.1816 21.3824 32.8929 11.4352 8.4791 4.5930 42.4086 2.6866 0.1539 6.6535 4.4393 1.5320 5.9904 22.7610 14.4468 15.7013 22.3449 7.5272 26.7598 14.2506 44.8261 15.2622 1.6960 41.5117 22.7781 1.2309 9.1690 5.5998 7.4741 27.7581 11.9840 20.0780 54.4037 23.8174 7.6416 13.1302 11.6796 15.3659 1.2341 5.2394 0.8132 3.7662 11.5140 25.8920 25.4850 11.9756 5.9989 6.5275 20.7948 1.5799 40.1204 40.0600 165.9000 93.7943 56.5389 17.9553 35.1877 36.7537 29.5338 8.2668 50.2878 30.8016 26.0784 24.0755 56.8443 39.5086 6.1869 20.2455 27.8036 20.2126 5.6507 42.0625 7.5328
temp: 298.150 k
press: 1.00000 atm
elementType: 8 8 7 6 6 6 6 6 6 6 6 6 6 6 6 6 6 6 6 6 6 6 6 1 1 1 1 1 1 1 1 1 1 1 1 1 1 1 1 1 1 1 1 1 1 1
symmnumber: 1
zpe: 1003652.7 jmol-1
zpe.correction: 0.382271 hartree
zpe.thermalcorrener: 0.403511 hartree
zpe.thermalcorrenthalpy: 0.404455 hartree
zpe.thermalcorrgfe: 0.332778 hartree
zpe.sumelectzpe: -979.413372 hartree
zpe.sumelectthermal: -979.392132 hartree
zpe.sumelectthermalent: -979.391188 hartree
zpe.sumelectthermalfe: -979.462865 hartree
dipole: 0.4263 -0.1367 -0.6201
dipole: 0.7648
quadrupole: -119.5778 -129.4897 -137.6992
quadrupole: -0.6858 -0.2186 4.8314
quadrupole: 9.3444 -0.5675 -8.7769 -0.6858 -0.2186 4.8314
hfenergy: -979.7956431 hartree
pointgroup: C01 [X(C20H23N1O2)]
dipole: 0.1717589 0.0376631 0.2441792 debye
polarizability: 280.4948825|-1.6986978|289.5612936|-9.3554957|-2.5672729|135.1412781 unknown
InChI: InChI=1S/C20H23NO2/c1-4-21-10-9-14-12-17(22-2)20(23-3)19-15-8-6-5-7-13(15)11-16(21)18(14)19/h5-8,12,16H,4,9-11H2,1-3H3
charge 0 multiplicity 1
46 atoms
O  -3.129087 0.069556 -0.066029
O  -3.001014 2.906011 -0.253624
N  3.112205 0.61028 -0.066036
C  1.87119 -0.16814 0.212656
C  0.587749 0.664926 0.083319
C  1.716869 -1.37987 -0.740604
C  3.060354 1.962415 0.546341
C  0.624175 2.0721 -0.060017
C  1.95659 2.797624 -0.112271
C  -0.6634 -0.041205 0.09126
C  0.531212 -2.210382 -0.28333
C  -0.646445 -1.531819 0.163988
C  4.340672 -0.119682 0.359184
C  -1.865459 0.714745 -0.03203
C  -0.585227 2.799865 -0.146745
C  -1.820848 2.13458 -0.118767
C  0.58504 -3.621159 -0.26004
C  -1.731656 -2.307701 0.658309
C  5.609278 0.372405 -0.363063
C  -0.508342 -4.382309 0.21137
C  -1.66341 -3.717016 0.681188
C  -3.789654 0.117864 -1.392525
C  -3.91772 2.851807 0.90803
H  1.899914 -0.572153 1.262746
H  2.627537 -2.002901 -0.756392
H  1.570213 -0.988271 -1.767398
H  4.037937 2.452502 0.397508
H  2.882807 1.901829 1.651698
H  2.237999 2.985374 -1.167013
H  1.876043 3.783059 0.385321
H  4.481402 -0.048764 1.46847
H  4.207083 -1.191424 0.132165
H  -0.581278 3.891725 -0.233293
H  1.495056 -4.12606 -0.60678
H  -2.628716 -1.798838 1.015007
H  5.482084 0.280635 -1.455708
H  5.838461 1.428639 -0.134315
H  6.483894 -0.230791 -0.055939
H  -0.453644 -5.476752 0.225603
H  -2.510837 -4.29375 1.068731
H  -3.945717 1.165669 -1.706219
H  -4.755634 -0.393492 -1.260038
H  -3.178198 -0.419821 -2.140968
H  -4.236684 1.813878 1.109502
H  -4.78107 3.475002 0.628301
H  -3.422226 3.276206 1.802348
