program: Gaussian 09
title: 000200609
version: EM64L-G09RevD.01
frameworkgroup: C1[X(C10H10FN7)]
method: RPBEPBE
basis: SDD
operation: Freq
keyword: #p
keyword: freq=noraman
keyword: PBEPBE/SDD
title: #p freq=noraman PBEPBE/SDD
converged: YES YES NO NO
title: Mulliken charges:
elementType: F N N N N N N N C C C C C C C C C C H H H H H H H H H H
charge: -0.205493 -0.107199 -0.115754 -0.087037 -0.256362 -0.617656 -0.610973 -0.579620 -0.085319 0.182831 0.169875 0.260823 0.008546 -0.336976 -0.283351 -0.342296 -0.339200 0.311532 0.242141 0.253229 0.255294 0.252377 0.381475 0.315719 0.341914 0.327153 0.332324 0.332004
chargesum: 0.00000
title: Mulliken charges with hydrogens summed into heavy atoms:
elementType: F N N N N N N N C C C C C C C C C C
charge: -0.205493 -0.107199 -0.115754 -0.087037 -0.256362 0.079538 0.058094 0.084708 -0.085319 0.182831 0.169875 0.260823 0.008546 -0.094835 -0.030122 -0.087002 -0.086823 0.311532
polarizability: 4.00519784e+02 -4.57182768e+00 1.72033764e+02 -1.08718730e-01 1.23550901e-01 6.24048018e+01
1716.lowfreq: -5.3835 -3.7406 -0.0006 -0.0004 0.0008 7.9654 18.7020 39.8024 66.2970
frequency: 18.5988 39.8019 66.2858 86.8037 168.0190 189.0231 203.9637 208.2661 225.9168 269.7838 315.4968 337.9384 368.4936 371.7693 404.2395 419.6076 464.9651 470.1941 485.3633 516.2985 522.0292 527.3387 552.4239 569.9614 583.1365 603.3272 621.9677 627.8757 641.5096 677.6987 716.5799 723.9669 751.9879 793.0425 809.6419 809.7787 840.4948 883.4461 900.7356 924.8036 947.6599 960.7878 974.1354 993.3704 1096.3686 1125.1272 1139.8943 1150.8520 1175.1555 1187.1615 1202.1250 1267.3334 1284.2386 1343.0903 1368.3499 1381.6726 1415.9426 1428.9911 1447.7125 1475.4507 1487.0404 1505.8984 1560.4531 1578.8641 1588.6480 1592.7823 1604.9056 1620.6981 3131.8584 3151.6078 3159.5918 3177.5370 3181.3049 3525.5192 3556.4394 3602.5576 3690.1264 3717.0941
redmass: 4.2000 6.3296 6.4928 6.8712 7.8035 6.9865 5.2588 7.9528 5.5456 9.1578 2.7934 3.1229 5.3010 6.1986 3.8934 3.4638 7.5699 5.1014 1.2271 1.2897 6.6322 2.2864 1.0583 5.2222 5.2430 1.3588 1.0698 7.1414 5.8734 7.3561 4.9465 6.3888 7.0011 8.2240 1.3289 5.6774 1.6482 7.5300 1.1113 2.7453 1.3574 1.3393 2.0135 2.6647 1.2918 2.0369 1.7980 1.8528 2.4710 2.6684 4.5950 3.6583 1.5647 9.7212 6.8978 6.8914 4.1571 2.5015 4.5867 2.3987 2.3700 2.1127 2.4100 3.0806 5.9062 1.8923 6.2890 2.1691 1.0680 1.0887 1.0881 1.0963 1.0965 1.0440 1.0441 1.0869 1.1050 1.1059
irintensity: 0.0090 0.1651 0.3378 0.5242 4.5760 0.3627 16.4327 0.3141 3.3406 0.7239 11.6673 6.2814 7.8251 9.2526 7.4420 0.4591 16.0232 21.5159 199.8074 230.3219 1.5844 0.3935 6.4018 15.2337 1.6873 263.6372 42.6962 1.2677 0.6162 0.4660 6.2400 1.1081 23.8331 30.8261 0.2826 3.7000 67.6903 4.6804 116.5900 8.4362 3.3512 0.0330 13.4940 4.8346 14.8980 5.8321 14.2374 38.9730 6.8266 119.6213 12.1788 9.7787 6.9975 446.7817 127.7952 94.0335 11.4006 46.2683 55.0006 98.3717 264.3692 78.4470 527.5498 709.3393 80.8428 792.2891 71.3476 172.3908 83.9634 4.2247 5.5538 9.1557 6.6158 52.6304 234.6978 77.3481 69.7566 49.3157
temp: 298.150 k
press: 1.00000 atm
elementType: 9 7 7 7 7 7 7 7 6 6 6 6 6 6 6 6 6 6 1 1 1 1 1 1 1 1 1 1
symmnumber: 1
zpe: 541375.5 jmol-1
zpe.correction: 0.206199 hartree
zpe.thermalcorrener: 0.221460 hartree
zpe.thermalcorrenthalpy: 0.222404 hartree
zpe.thermalcorrgfe: 0.162775 hartree
zpe.sumelectzpe: -868.912545 hartree
zpe.sumelectthermal: -868.897284 hartree
zpe.sumelectthermalent: -868.896340 hartree
zpe.sumelectthermalfe: -868.955969 hartree
dipole: -3.3033 0.2594 -0.0028
dipole: 3.3135
quadrupole: -99.5619 -83.4710 -109.2486
quadrupole: -2.4566 -0.0269 0.0122
quadrupole: -2.1347 13.9561 -11.8214 -2.4566 -0.0269 0.0122
hfenergy: -869.1187442 hartree
pointgroup: C01 [X(C10H10F1N7)]
dipole: 1.2969519 0.0694847 0.112002 debye
polarizability: 400.1885715|4.5475257|97.6994648|8.7331499|51.3307186|137.0703139 unknown
InChI: InChI=1S/C10H10FN7/c11-5-1-3-6(4-2-5)17-18-7-8(12)15-10(14)16-9(7)13/h1-4H,12-14H2
charge 0 multiplicity 1
28 atoms
F  -6.177264 0.15264 0.136892
N  3.612194 -0.679708 -1.010689
N  3.778406 0.706339 1.022454
N  0.197999 0.234756 0.311848
N  -0.608905 -0.361879 -0.563192
N  1.508928 -1.266514 -1.87974
N  1.855125 1.461063 2.120578
N  5.668311 -0.063912 -0.101159
C  1.559784 0.101718 0.12527
C  2.247846 -0.623048 -0.933603
C  2.420417 0.758886 1.093176
C  -2.002296 -0.183525 -0.315006
C  4.298634 -0.013059 -0.029982
C  -2.880559 -0.821088 -1.234765
C  -2.551043 0.57176 0.762109
C  -4.278553 -0.715384 -1.092746
C  -3.945038 0.68504 0.914702
C  -4.780406 0.038052 -0.016983
H  -2.447953 -1.397909 -2.058568
H  -1.871614 1.060777 1.464981
H  -4.965974 -1.20006 -1.791806
H  -4.388513 1.25966 1.733579
H  0.474331 -1.188058 -1.767538
H  1.993946 -1.772339 -2.620323
H  0.838213 1.500037 2.174769
H  2.456552 1.921311 2.799408
H  6.217954 0.415995 0.606524
H  6.10518 -0.58205 -0.858788
