program: Gaussian 09
title: 000200731
version: EM64L-G09RevD.01
frameworkgroup: C1[X(C21H26N4O3S)]
method: RPBEPBE
basis: SDD
operation: Freq
keyword: #p
keyword: freq=noraman
keyword: PBEPBE/SDD
title: #p freq=noraman PBEPBE/SDD
converged: NO YES NO NO
title: Mulliken charges:
elementType: S O O O N N N N C C C C C C C C C C C C C C C C C C C C C H H H H H H H H H H H H H H H H H H H H H H H H H H
charge: 0.915575 -0.437660 -0.552169 -0.557211 -0.088801 -0.085612 -0.262453 -0.082882 -0.363876 -0.365823 -0.377461 -0.378950 -0.537882 -0.342543 0.349740 -0.075562 -0.325341 0.152282 0.324885 -0.184179 -0.337504 -0.373651 -0.388435 -0.251716 -0.184907 -0.117319 -0.270677 -0.290196 -0.743961 0.232578 0.187033 0.197819 0.206701 0.197048 0.204305 0.191093 0.213946 0.213929 0.254492 0.225461 0.174647 0.233073 0.188033 0.245601 0.263266 0.286579 0.317421 0.232249 0.243355 0.333533 0.284304 0.286914 0.263716 0.265720 0.291474
chargesum: 0.00000
title: Mulliken charges with hydrogens summed into heavy atoms:
elementType: S O O O N N N N C C C C C C C C C C C C C C C C C C C C C
charge: 0.915575 -0.104127 -0.552169 -0.557211 -0.088801 -0.085612 -0.262453 -0.082882 0.055735 0.038697 0.023893 0.026090 -0.069461 0.057566 0.349740 -0.075562 0.095764 0.152282 0.324885 0.061422 -0.074239 -0.087072 -0.071014 -0.019467 0.058448 -0.117319 0.013627 -0.003282 0.076948
polarizability: 3.91958265e+02 7.00622224e+01 3.59302910e+02 1.32428060e+01 -2.83504634e+01 1.99826364e+02
1716.lowfreq: -16.4020 -2.1984 -0.0006 -0.0004 0.0010 2.7805 9.1091 19.7506 22.3753
frequency: -11.0841 19.0309 22.3270 36.9205 38.3955 47.4832 59.2297 71.4583 82.9834 87.6440 90.3244 124.6724 134.8505 157.3292 158.3845 168.7662 174.3530 203.0945 232.5494 241.4533 247.1429 258.5964 281.9301 292.9589 301.8474 314.5229 317.0833 327.6124 339.6477 347.4644 366.3868 379.6513 397.1774 405.5267 417.0712 430.0995 445.0980 480.7386 501.1250 523.6808 568.9020 574.2102 581.2721 595.5449 609.1753 621.3195 624.8758 689.1589 691.8159 738.9281 745.6329 749.3565 753.4219 774.1871 785.2753 791.0228 798.5303 802.8248 836.0259 849.4201 865.3055 880.7268 881.6706 885.3905 929.0733 938.1603 960.7543 965.3192 973.4027 975.6919 991.2443 995.4583 997.3657 1004.7247 1013.4963 1014.2291 1031.4259 1043.0786 1044.8512 1051.2300 1056.7591 1071.8751 1091.7458 1109.2890 1116.9314 1120.9564 1133.0675 1140.7400 1146.5177 1152.1031 1173.9629 1190.7484 1193.6360 1200.6257 1220.1048 1250.2888 1256.7150 1268.6699 1282.8577 1292.2471 1298.7322 1303.5929 1305.7477 1307.3928 1330.6941 1335.7691 1336.8946 1348.1524 1357.4073 1366.4931 1368.6527 1372.8445 1385.0419 1395.0449 1399.0242 1407.6846 1412.5099 1420.4395 1441.9746 1451.1372 1452.9701 1458.5649 1462.0213 1467.8405 1470.0378 1475.5305 1480.7166 1505.9768 1524.2763 1541.1510 1583.3190 1601.5901 1636.0647 2833.8213 2849.2425 2854.0493 2864.0773 2869.4149 2880.4975 2965.0166 2996.9805 3022.1219 3029.1269 3036.8388 3041.4469 3041.9602 3049.5248 3075.9300 3101.1883 3147.7728 3148.5746 3157.4171 3171.3191 3171.7485 3179.1296 3183.0674 3187.2367 3195.7057 3557.5871
redmass: 3.4052 5.3756 5.5387 5.5301 4.7990 4.3281 4.0855 2.7372 4.2813 3.6254 4.5301 4.1739 3.5482 1.2454 5.4279 5.0519 4.3983 3.9937 4.4260 3.3424 3.3477 2.4420 3.4281 2.8039 3.2699 2.1440 4.0569 4.4541 1.9374 5.0612 3.9392 4.5113 3.4409 2.3024 3.0372 7.7303 3.4638 2.9294 4.8807 3.9139 4.9295 4.2630 5.6655 6.7794 6.0362 2.1926 6.3041 5.1007 6.7879 2.8165 2.6317 2.2170 4.4044 4.6046 9.9575 3.2284 2.9460 1.4055 1.4266 1.5153 1.4070 2.3222 2.8477 2.0920 1.3403 2.4008 3.4456 1.5290 1.2971 2.2863 1.4079 3.8856 2.6368 1.8487 2.2171 2.8243 1.3658 1.7599 3.7785 2.0153 2.1761 2.1309 2.1649 1.6673 2.0371 1.7766 2.3671 1.9003 2.1893 1.7391 2.6525 1.1889 1.2507 1.3701 2.1360 1.7945 1.6426 1.4163 1.4522 1.1575 1.1410 1.2943 1.3373 1.3500 1.3608 1.6424 1.4842 1.3471 2.2665 1.5901 2.4387 1.4809 2.7151 1.9096 1.6926 1.0529 2.9493 1.0589 2.6223 1.0948 1.0805 1.1272 1.1543 2.0858 1.1309 1.1200 1.0879 5.0137 6.3912 6.6144 7.7092 5.5367 6.7591 1.0710 1.0705 1.0710 1.0700 1.0699 1.0676 1.0693 1.0866 1.0904 1.0246 1.0884 1.0897 1.0874 1.0882 1.0959 1.0963 1.0906 1.0916 1.0874 1.0961 1.0893 1.1070 1.1077 1.0961 1.1007 1.0662
irintensity: 0.7593 0.2416 5.2353 1.2841 0.9359 0.5272 0.6333 4.8040 0.9925 3.9352 5.3885 1.8531 1.8734 0.4986 0.7392 2.0912 1.3952 3.3860 0.6638 1.7841 6.9387 0.9272 9.5700 3.2020 27.5636 30.5087 68.8099 15.5102 71.0236 5.0454 2.2535 16.7550 3.2700 1.1077 0.3822 47.2842 3.5420 0.3835 2.3288 8.1634 7.3908 4.0943 41.2219 44.6188 4.1615 1.6991 3.3848 3.7403 11.5211 27.3582 12.6509 58.7413 1.7783 3.0869 82.2793 15.7500 6.4375 7.8275 3.8248 0.0323 19.3983 27.8043 11.4357 21.4384 0.3891 12.4663 98.7874 95.5455 0.8973 4.9413 4.2368 14.9170 87.7623 56.1831 0.5875 3.2668 5.1521 3.6076 6.3771 3.5282 56.1110 16.3195 3.1912 11.1274 13.2317 8.1730 19.6739 20.1358 65.8619 17.0395 2.8910 0.9219 1.5791 8.8695 16.5909 43.0677 14.7045 13.0146 8.6215 10.1532 4.3661 0.9323 14.8733 8.7650 31.9915 27.5591 23.7172 28.4027 36.9963 5.5906 7.9667 6.8893 1.0143 3.7045 2.2366 9.4611 22.8939 17.0809 9.4085 1.3230 0.9352 16.5352 6.2840 30.2945 5.0120 12.5314 7.1899 2.8337 6.6428 0.7370 0.2905 17.0472 7.1330 81.6592 55.6808 70.7357 2.1010 16.1369 292.7521 54.9047 11.8442 40.1069 1.4083 5.6873 60.9997 32.4531 32.7535 62.7665 27.3428 0.7640 1.6791 3.8565 0.4072 3.3347 1.3158 1.6116 6.6521 10.8008 9.3501
temp: 298.150 k
press: 1.00000 atm
elementType: 16 8 8 8 7 7 7 7 6 6 6 6 6 6 6 6 6 6 6 6 6 6 6 6 6 6 6 6 6 1 1 1 1 1 1 1 1 1 1 1 1 1 1 1 1 1 1 1 1 1 1 1 1 1 1
symmnumber: 1
zpe: 1155808.2 jmol-1
zpe.correction: 0.440224 hartree
zpe.thermalcorrener: 0.467431 hartree
zpe.thermalcorrenthalpy: 0.468375 hartree
zpe.thermalcorrgfe: 0.380840 hartree
zpe.sumelectzpe: -1656.225093 hartree
zpe.sumelectthermal: -1656.197887 hartree
zpe.sumelectthermalent: -1656.196943 hartree
zpe.sumelectthermalfe: -1656.284477 hartree
dipole: 5.5990 4.6978 5.2162
dipole: 8.9792
quadrupole: -209.9081 -183.6252 -175.1198
quadrupole: 8.9267 -25.2884 -5.4280
quadrupole: -20.3571 5.9258 14.4313 8.9267 -25.2884 -5.4280
hfenergy: -1656.6653176 hartree
pointgroup: C01 [X(C21H26N4O3S1)]
dipole: 2.5641032 -1.4697684 1.9352362 debye
polarizability: 416.3541549|-57.1793416|338.4973803|-24.9262662|-10.3607437|196.236004 unknown
InChI: InChI=1S/C21H26N4O3S/c1-29(27,28)18-7-5-17(6-8-18)21-19(25-9-3-2-4-20(25)22-21)16-24-12-10-23(11-13-24)14-15-26/h2-9,26H,10-16H2,1H3
charge 0 multiplicity 1
55 atoms
S  -4.012429 4.340564 0.186565
O  -2.666062 -7.114937 -2.073107
O  -3.847671 5.655344 -0.77556
O  -5.197617 3.23182 -0.038066
N  -0.052552 -1.722819 0.828736
N  -1.336013 -4.142737 -0.109023
N  3.060804 -0.115067 0.360474
N  2.455751 1.920832 -0.511994
C  0.529274 -2.514742 -0.283281
C  -0.812811 -2.599084 1.756882
C  -0.585177 -3.258959 -1.035594
C  -1.920767 -3.346051 0.996807
C  0.942249 -0.887786 1.558474
C  -2.323669 -5.009705 -0.791103
C  1.704766 0.069088 0.686166
C  1.360572 1.32795 0.125653
C  -1.661529 -6.234111 -1.457525
C  3.484233 1.049162 -0.37259
C  0.060993 2.023439 0.155739
C  3.937183 -1.162054 0.626104
C  4.831047 1.120991 -0.82309
C  0.02973 3.421939 -0.113367
C  -1.157527 1.329945 0.408103
C  5.249933 -1.078604 0.184324
C  5.707314 0.070362 -0.54679
C  -2.359263 3.413932 0.1996
C  -1.187494 4.130973 -0.09841
C  -2.382548 2.030263 0.434459
C  -4.210702 4.998102 1.976535
H  1.046193 -1.826976 -0.976411
H  1.271576 -3.264122 0.092219
H  -0.143256 -3.348496 2.248461
H  -1.265212 -1.970945 2.548086
H  -1.260055 -2.504384 -1.514013
H  -0.132832 -3.868859 -1.837466
H  -2.665298 -2.598032 0.622937
H  -2.442095 -4.029737 1.69162
H  1.662736 -1.526062 2.130736
H  0.378115 -0.305973 2.313674
H  -3.042488 -5.386875 -0.040719
H  -2.920421 -4.44514 -1.555938
H  -1.168208 -6.853279 -0.692797
H  -0.899685 -5.924246 -2.203682
H  3.544313 -2.018966 1.176404
H  5.137239 2.010004 -1.379461
H  0.971924 3.926199 -0.347097
H  -1.142104 0.23724 0.52165
H  5.929427 -1.907495 0.398824
H  6.745512 0.114591 -0.888629
H  -3.133197 -6.619737 -2.793161
H  -1.235706 5.1980 -0.340536
H  -3.337531 1.515616 0.58677
H  -4.230807 4.123066 2.640214
H  -3.358671 5.663873 2.17022
H  -5.167591 5.538589 1.97107
