program: Gaussian 09
title: 000200621
version: EM64L-G09RevD.01
frameworkgroup: C1[X(C15H22N2O)]
method: RPBEPBE
basis: SDD
operation: Freq
keyword: #p
keyword: freq=noraman
keyword: PBEPBE/SDD
title: #p freq=noraman PBEPBE/SDD
converged: NO YES NO NO
title: Mulliken charges:
elementType: O N N C C C C C C C C C C C C C C C H H H H H H H H H H H H H H H H H H H H H H
charge: -0.249329 -0.073464 -0.352715 -0.355268 -0.373575 -0.399676 -0.402395 -0.399885 -0.095602 -0.757810 0.187260 -0.549651 0.491624 -0.368781 -0.432866 -0.233343 -0.220651 -0.240478 0.160196 0.222456 0.249540 0.160798 0.190801 0.209011 0.211525 0.192289 0.214918 0.187176 0.166110 0.219589 0.223066 0.259610 0.292812 0.261574 0.222985 0.268849 0.228741 0.229487 0.225934 0.229141
chargesum: 0.00000
title: Mulliken charges with hydrogens summed into heavy atoms:
elementType: O N N C C C C C C C C C C C C C C C
charge: -0.249329 -0.073464 -0.059902 0.027384 0.036763 0.000137 0.001419 0.002208 0.070508 -0.055547 0.187260 -0.065093 0.491624 -0.099932 -0.204125 -0.003856 0.005283 -0.011337
polarizability: 2.05699770e+02 -1.34994304e+01 1.77390014e+02 1.95165980e+01 9.78699859e+00 1.36146047e+02
1716.lowfreq: -10.8741 -5.4768 -0.0008 -0.0003 0.0002 8.6527 17.6136 28.3330 32.9607
frequency: 15.0155 26.8292 32.8552 48.8728 54.1554 94.4295 134.2775 179.4108 201.6261 215.3786 228.4391 244.5533 257.9936 293.6880 309.6193 330.0101 375.4604 393.8499 404.6344 409.9381 447.3928 473.0968 501.4314 564.2951 573.3647 609.2066 616.9286 671.6722 704.3893 708.9165 756.7190 767.1334 806.4262 810.6120 828.9412 852.8958 859.3042 860.6649 914.4598 925.8992 942.1981 958.9282 982.6655 986.9981 989.9549 1000.0752 1012.1987 1023.9096 1028.2838 1044.4937 1069.5271 1079.9400 1087.5129 1104.6244 1122.7049 1136.6746 1154.3818 1157.0922 1172.3017 1186.2776 1190.8434 1212.0249 1235.1615 1240.4145 1258.3415 1270.9610 1287.6457 1304.9022 1324.8811 1331.4565 1335.0801 1343.7699 1350.5289 1352.9878 1359.2379 1384.2418 1385.2127 1388.1471 1440.5980 1451.8200 1454.0558 1461.3040 1462.5614 1466.0129 1471.7317 1475.3118 1479.2766 1481.6521 1484.8155 1594.2122 1613.2955 1620.5697 2761.9595 2797.8260 2814.2262 2966.2081 2986.9249 2988.5265 2996.8206 3001.6197 3033.5545 3039.9313 3046.8398 3055.5457 3062.4812 3063.0873 3088.4474 3111.0779 3112.9108 3122.5015 3133.7243 3144.8870 3162.4221 3538.9940
redmass: 3.9345 3.1896 4.7119 3.7894 5.1700 3.3322 3.6870 3.0788 3.5583 1.6346 2.1393 2.6728 3.1986 2.0548 2.8871 3.0004 1.8284 3.0512 2.8465 3.1542 2.9300 3.0626 2.4903 1.9685 1.4740 2.7470 6.0034 3.0413 4.5132 1.8314 2.0383 3.6584 1.6051 2.9301 2.7523 2.7659 1.3995 1.2497 2.4957 1.4191 2.3164 1.3027 1.3866 2.4598 4.1390 1.3744 2.0609 2.8210 2.4957 1.9836 1.7265 1.6408 1.5734 2.4650 2.5377 2.0677 1.3038 2.3408 1.0547 1.3329 1.4794 2.4575 1.9928 1.4119 1.2628 1.1703 1.2156 1.3953 1.3089 1.3046 1.3898 1.4320 1.3334 1.4690 1.4824 6.2840 1.2143 1.4338 2.1546 1.0893 1.1856 1.0864 1.0793 1.0930 1.0924 1.6943 1.0970 1.0891 1.9639 6.0643 5.9933 6.5036 1.0795 1.0716 1.0702 1.0628 1.0613 1.0609 1.0357 1.0596 1.0954 1.0870 1.1027 1.1018 1.0887 1.1027 1.0981 1.1012 1.0874 1.0866 1.0915 1.0961 1.1015 1.0776
irintensity: 0.2130 0.1895 2.1541 1.0509 3.6462 2.5262 1.4987 0.2678 1.3606 1.3190 0.2522 4.8694 4.0998 2.4983 1.2525 4.8067 2.9987 6.7491 0.1535 3.9816 0.1505 7.9427 6.7615 21.2322 45.6658 59.3622 2.4419 3.7123 5.5487 54.0027 54.6301 3.5194 1.4044 9.9880 2.3126 4.6453 5.2197 0.2864 3.1527 7.1065 14.2832 2.0245 0.4193 3.8935 1.7229 1.0836 4.2615 7.7486 1.2493 16.4319 1.8681 9.4498 20.0943 14.8727 6.2647 8.4843 3.3625 30.9695 0.2144 31.4043 39.0019 4.1773 6.4471 85.7208 6.2732 11.7546 3.7707 17.7033 11.0857 1.0841 3.2168 0.6053 8.4748 1.7077 1.4305 2.2484 21.3994 0.4300 28.3075 7.1425 38.1465 15.1351 1.8673 6.3955 7.4803 96.7788 24.6516 3.8867 65.2276 1.9883 7.2064 116.0903 83.1570 50.8267 192.2581 39.1458 40.0592 30.8505 20.6526 44.8018 70.6014 36.7777 21.0657 64.7385 44.2203 6.3256 36.8282 14.0095 9.4368 0.4994 10.9226 36.2480 24.1132 10.5662
temp: 298.150 k
press: 1.00000 atm
elementType: 8 7 7 6 6 6 6 6 6 6 6 6 6 6 6 6 6 6 1 1 1 1 1 1 1 1 1 1 1 1 1 1 1 1 1 1 1 1 1 1
symmnumber: 1
zpe: 904909.8 jmol-1
zpe.correction: 0.344662 hartree
zpe.thermalcorrener: 0.362198 hartree
zpe.thermalcorrenthalpy: 0.363142 hartree
zpe.thermalcorrgfe: 0.296724 hartree
zpe.sumelectzpe: -768.147859 hartree
zpe.sumelectthermal: -768.130323 hartree
zpe.sumelectthermalent: -768.129379 hartree
zpe.sumelectthermalfe: -768.195797 hartree
dipole: -0.4249 0.6990 -4.0583
dipole: 4.1399
quadrupole: -100.2006 -104.1593 -112.5271
quadrupole: -0.2049 1.4597 8.7988
quadrupole: 5.4284 1.4697 -6.8981 -0.2049 1.4597 8.7988
hfenergy: -768.4925205 hartree
pointgroup: C01 [X(C15H22N2O1)]
dipole: 0.1238968 -0.4130069 -1.5706533 debye
polarizability: 205.1023197|-14.9290129|174.6247613|-20.170799|-13.2336773|139.5087498 unknown
InChI: InChI=1S/C15H22N2O/c1-13(17-10-6-3-7-11-17)15(18)16-12-14-8-4-2-5-9-14/h2,4-5,8-9,13,16H,3,6-7,10-12H2,1H3
charge 0 multiplicity 1
40 atoms
O  -0.333357 1.865609 1.39586
N  -2.467166 0.118789 0.06257
N  0.571537 1.620904 -0.733487
C  -3.866663 -0.120917 -0.376562
C  -1.604238 -1.056461 -0.230238
C  -4.458179 -1.372413 0.305298
C  -2.131272 -2.333533 0.453187
C  -3.589548 -2.619707 0.033677
C  -1.879437 1.373503 -0.479294
C  -2.742902 2.622831 -0.19204
C  -0.489123 1.622975 0.162358
C  1.962625 1.872564 -0.306154
C  2.798046 0.600201 -0.191559
C  2.468234 -0.37856 0.783284
C  3.907475 0.376343 -1.042574
C  3.23331 -1.558979 0.897471
C  4.675644 -0.806611 -0.929707
C  4.338924 -1.777879 0.039896
H  -3.923671 -0.2489 -1.492696
H  -4.481658 0.755036 -0.111755
H  -0.581557 -0.844609 0.128737
H  -1.536523 -1.234264 -1.339574
H  -5.493133 -1.526179 -0.057003
H  -4.507537 -1.187813 1.395786
H  -2.081555 -2.192749 1.549932
H  -1.471493 -3.183537 0.192616
H  -3.987468 -3.497712 0.57658
H  -3.621825 -2.864272 -1.048686
H  -1.739012 1.289127 -1.595364
H  -3.694544 2.607558 -0.749318
H  -2.195813 3.534502 -0.49185
H  -2.947742 2.683829 0.889819
H  0.400046 1.32408 -1.696363
H  1.881978 2.36859 0.67835
H  2.433555 2.57871 -1.01504
H  1.621101 -0.197499 1.456034
H  4.175411 1.130563 -1.793775
H  2.974732 -2.30461 1.657862
H  5.533081 -0.967714 -1.592962
H  4.933613 -2.693792 0.131086
