program: Gaussian 09
title: 000200587
version: EM64L-G09RevD.01
frameworkgroup: C1[X(C8H18NO3PS2)]
method: RPBEPBE
basis: SDD
operation: Freq
keyword: #p
keyword: freq=noraman
keyword: PBEPBE/SDD
title: #p freq=noraman PBEPBE/SDD
converged: NO YES NO NO
title: Mulliken charges:
elementType: S S P O O O N C C C C C C C C H H H H H H H H H H H H H H H H H H
charge: 0.126302 -0.244708 0.557511 -0.477328 -0.482939 -0.275045 -0.122770 -0.762013 0.312026 -0.220305 -0.203473 -0.607979 -0.625994 -0.652228 -0.656482 0.300161 0.314196 0.236297 0.220936 0.229920 0.224947 0.285910 0.225385 0.226015 0.234777 0.261088 0.235965 0.213299 0.224356 0.229711 0.211727 0.223423 0.237312
chargesum: 0.00000
title: Mulliken charges with hydrogens summed into heavy atoms:
elementType: S S P O O O N C C C C C C C C
charge: 0.126302 -0.244708 0.557511 -0.477328 -0.482939 -0.275045 -0.122770 -0.147656 0.312026 0.236928 0.251394 0.129331 0.105836 0.015138 0.015979
polarizability: 2.33334615e+02 5.92213078e+00 1.46269668e+02 1.62146272e+01 1.08420162e+01 1.54708043e+02
1716.lowfreq: -5.6164 0.0019 0.0024 0.0024 5.4395 9.2251 19.8307 27.4921 32.4672
frequency: 19.0723 27.0727 32.1601 35.0332 45.1684 49.4917 59.5996 70.6528 87.0261 102.5038 122.1399 125.8262 132.9959 150.7521 153.4478 206.1790 218.9842 243.8448 245.9066 259.8973 275.9164 282.6911 290.2187 321.3760 364.2290 408.3642 438.2568 456.9736 544.7884 554.9528 581.5068 654.1400 686.9661 723.7960 776.9444 809.6367 811.2011 862.7922 873.7329 916.0065 961.1882 1017.7433 1027.0029 1052.9997 1091.5906 1102.4907 1104.0839 1130.4763 1136.4610 1137.0389 1138.1727 1153.0590 1235.5828 1253.0256 1255.6693 1257.5450 1352.5041 1357.7184 1393.2050 1394.3802 1395.5700 1412.5254 1433.0638 1446.4674 1457.6626 1458.4860 1469.0997 1473.9925 1476.3825 1477.6882 1486.8651 1487.6960 1489.8643 1502.7430 1575.8366 2964.8639 2972.1506 2982.6737 2989.5380 2993.8372 2994.7851 3029.9063 3033.3021 3046.5735 3047.6434 3054.1099 3090.0341 3090.2447 3105.8708 3106.7833 3108.7670 3121.0561 3123.6136
redmass: 3.4522 3.6172 3.3386 2.0223 2.9105 1.9872 1.9078 2.5517 3.2306 5.8099 5.0435 1.2651 5.5640 6.1419 2.1771 3.8215 2.0845 1.3376 2.4219 1.8522 4.9430 3.8654 7.7605 5.5381 3.2934 5.7947 3.6302 8.2172 2.8105 13.2881 5.0605 6.7198 7.9421 6.2640 6.0496 1.0900 1.0920 4.1042 3.5673 1.8035 2.8352 2.4976 2.7755 1.3701 1.2227 2.2131 2.2150 1.4104 1.4429 1.6318 1.3681 1.1941 3.7471 1.1879 1.5980 1.1351 1.2563 1.2556 1.2754 1.2786 2.5362 1.1796 1.0896 1.2066 1.0405 1.0408 1.0419 1.0899 1.0520 1.0502 1.0458 1.0797 1.0795 1.2583 5.1513 1.0376 1.0362 1.0556 1.0522 1.0369 1.0399 1.0575 1.1014 1.1076 1.1019 1.1080 1.0983 1.0981 1.1020 1.1059 1.1022 1.0974 1.0951
irintensity: 0.1921 4.3554 1.1764 0.0748 2.7590 0.2662 0.1812 3.3756 2.0286 1.9706 0.9497 0.8082 6.8110 9.6568 2.9980 11.2915 5.0556 0.4968 8.7382 6.1727 6.2985 4.7542 26.9497 4.6151 32.1729 3.4399 1.3692 17.6599 2.1120 121.4503 8.7583 103.1851 98.3860 18.8646 9.8665 2.9726 2.2971 192.5030 77.3986 6.5745 18.3576 137.6599 89.7634 5.6329 0.0626 9.7862 16.3769 8.3121 11.5030 114.1536 35.2698 1.0933 22.1966 0.6090 20.5780 0.9417 6.9846 7.3739 19.6096 24.0067 98.0960 43.1846 13.1659 8.2549 12.1204 13.0703 3.3401 13.1627 3.6321 8.0689 26.6802 11.5539 9.1334 3.7500 326.2059 36.3604 109.0284 29.1440 24.1815 27.1637 26.7283 19.9240 34.9259 10.4637 32.4960 11.7256 27.4083 29.5333 35.2509 0.9856 33.5216 1.1865 17.8229
temp: 298.150 k
press: 1.00000 atm
elementType: 16 16 15 8 8 8 7 6 6 6 6 6 6 6 6 1 1 1 1 1 1 1 1 1 1 1 1 1 1 1 1 1 1
symmnumber: 1
zpe: 684705.8 jmol-1
zpe.correction: 0.260791 hartree
zpe.thermalcorrener: 0.282508 hartree
zpe.thermalcorrenthalpy: 0.283452 hartree
zpe.thermalcorrgfe: 0.205527 hartree
zpe.sumelectzpe: -1732.192861 hartree
zpe.sumelectthermal: -1732.171144 hartree
zpe.sumelectthermalent: -1732.170200 hartree
zpe.sumelectthermalfe: -1732.248125 hartree
dipole: 2.4545 2.0459 7.0436
dipole: 7.7345
quadrupole: -103.7558 -105.3200 -121.2015
quadrupole: 3.5853 4.4890 -3.1985
quadrupole: 6.3367 4.7724 -11.1090 3.5853 4.4890 -3.1985
hfenergy: -1732.4536517 hartree
pointgroup: C01 [X(C8H18N1O3P1S2)]
dipole: -0.6206284 -0.0466947 2.9786756 debye
polarizability: 227.3608609|-8.3608134|142.4934824|-26.1937617|-4.9846081|164.4579822 unknown
InChI: InChI=1S/C8H18NO3PS2/c1-5-11-13(14,12-6-2)15-7-8(10)9(3)4/h5-7H2,1-4H3
charge 0 multiplicity 1
33 atoms
S  -0.43635 0.161676 -1.935317
S  3.238238 -0.256796 -2.368859
P  1.63294 -0.233355 -1.067164
O  1.770357 0.883647 0.284141
O  1.29834 -1.655958 -0.123754
O  -3.175774 0.670829 -1.71495
N  -3.681215 0.277483 0.527771
C  -1.343092 -0.037318 -0.272183
C  -2.80307 0.333275 -0.544396
C  2.379226 2.217266 0.02033
C  2.454078 -2.33461 0.538691
C  -5.099525 0.613921 0.309468
C  -3.314475 -0.116607 1.895904
C  2.513498 2.9038 1.377151
C  1.905771 -3.633707 1.120687
H  -0.858727 0.629214 0.460901
H  -1.222049 -1.082341 0.053496
H  3.360045 2.071686 -0.471015
H  1.718298 2.786457 -0.662239
H  3.2394 -2.520641 -0.218915
H  2.854626 -1.663994 1.321908
H  -5.233135 0.883562 -0.748815
H  -5.397298 1.468464 0.946595
H  -5.74514 -0.252081 0.551107
H  -3.549561 0.697959 2.608367
H  -2.241483 -0.342145 1.975444
H  -3.880397 -1.017271 2.20476
H  2.95973 3.90684 1.244532
H  1.527695 3.023163 1.858497
H  3.163759 2.318032 2.048964
H  2.71811 -4.187557 1.626935
H  1.111526 -3.430084 1.859265
H  1.490152 -4.27191 0.32289
