program: Gaussian 09
title: 000200595
version: EM64L-G09RevD.01
frameworkgroup: C1[X(C19H22ClN3O)]
method: RPBEPBE
basis: SDD
operation: Freq
keyword: #p
keyword: freq=noraman
keyword: PBEPBE/SDD
title: #p freq=noraman PBEPBE/SDD
converged: YES YES NO NO
title: Mulliken charges:
elementType: Cl O N N N C C C C C C C C C C C C C C C C C C C H H H H H H H H H H H H H H H H H H H H H H
charge: -0.066478 -0.255739 -0.211941 -0.107224 -0.079548 0.349900 0.031689 -0.415827 -0.559222 0.101597 -0.332124 -0.269707 0.507214 -0.343838 -0.348263 -0.200522 -0.247749 -0.626066 -0.614391 -0.424208 -0.372031 -0.069779 -0.198332 -0.241760 0.231320 0.221383 0.261592 0.227085 0.172817 0.206170 0.217006 0.215788 0.245444 0.255104 0.224590 0.225936 0.184528 0.220576 0.237798 0.224899 0.223071 0.186119 0.257509 0.262987 0.234211 0.258416
chargesum: 0.00000
title: Mulliken charges with hydrogens summed into heavy atoms:
elementType: Cl O N N N C C C C C C C C C C C C C C C C C C C
charge: -0.066478 -0.255739 -0.211941 -0.107224 -0.079548 0.349900 0.031689 0.036876 -0.070546 0.101597 0.046863 0.163087 0.507214 -0.098394 -0.093159 0.024068 -0.021812 0.016835 0.019698 -0.166698 -0.109044 -0.069779 0.035879 0.016655
polarizability: 3.25728823e+02 -2.13761860e+00 2.31579207e+02 1.40502789e+01 5.13691742e+00 1.67760564e+02
1716.lowfreq: -10.0770 -5.8679 -0.0012 -0.0009 0.0015 1.8620 7.8299 9.7361 17.9713
frequency: -6.9116 9.2514 17.9013 27.8198 38.1491 39.6467 82.7882 100.0944 118.5523 133.9463 139.0256 149.8186 170.9798 185.9387 194.2633 205.3396 233.6997 238.9862 245.5676 272.3747 288.7989 335.5341 345.8132 369.2847 373.2803 399.8862 424.9277 429.5672 438.5326 475.9004 495.7794 533.6645 551.4725 557.4352 598.2806 620.1107 633.2970 663.9196 682.6446 718.2579 747.8783 752.5709 756.5676 772.3992 786.5672 803.9715 815.3511 838.2441 851.7823 871.2100 879.2100 910.7063 931.1726 945.4420 946.3797 980.7094 985.0061 985.8317 1005.9966 1022.1387 1032.6357 1035.1628 1069.1194 1072.2992 1078.6965 1083.9846 1093.0118 1095.7888 1100.5785 1138.2886 1142.9492 1157.8697 1174.3900 1178.0969 1185.0767 1204.3562 1219.8143 1258.8208 1259.6573 1270.0940 1283.3891 1287.9169 1300.1682 1300.8034 1336.2458 1348.6529 1367.8720 1379.4937 1381.0682 1384.2350 1411.5532 1418.9059 1423.7468 1427.4616 1442.3895 1449.9542 1461.9205 1462.7934 1468.8136 1472.6650 1475.8845 1478.4501 1483.7804 1486.6864 1490.8595 1508.4012 1580.1604 1585.3270 1609.1883 1627.5070 2814.4506 2840.7503 2857.4625 2979.1458 2997.3397 2999.4356 3010.4643 3018.1806 3032.2010 3035.2818 3061.8931 3076.7178 3079.9532 3090.1387 3131.6940 3138.6310 3144.1296 3146.2200 3157.2955 3159.5676 3171.4646 3176.2237
redmass: 5.7916 8.0349 2.6010 4.4671 5.4277 4.7979 3.5374 1.7729 4.3844 2.4713 4.6298 4.7896 5.1470 5.0292 4.7428 5.2922 1.1531 2.1096 1.8435 2.7156 2.9336 2.4027 3.8531 6.6686 3.5033 7.9196 2.9638 2.9079 2.6423 3.0470 3.9932 5.7361 4.5549 5.3382 6.0746 6.2769 6.1126 7.0220 3.1631 3.7747 3.1211 5.1761 1.5782 1.1280 1.6635 3.2826 4.5930 4.6501 1.4022 1.2127 1.4638 1.3935 6.2212 1.4034 2.6580 1.3082 5.2538 1.4074 2.2168 2.5555 1.7182 3.3404 2.4613 2.2177 2.6552 2.5961 1.3979 1.6124 1.5913 1.5769 1.5525 1.4531 1.4582 1.0919 1.8302 2.5820 1.7499 2.0816 1.5000 1.2217 1.5497 1.3318 1.6409 1.3257 1.5433 2.1273 1.8654 3.8544 1.5047 4.2647 3.4175 1.1513 2.9886 2.9486 1.1709 1.2304 1.0623 1.0523 2.0796 1.0997 1.0710 1.0789 1.2645 1.9181 1.2206 4.6916 6.5537 7.2196 6.5994 7.7659 1.0701 1.0576 1.0576 1.0567 1.0620 1.0826 1.0627 1.0718 1.0719 1.1056 1.0996 1.1017 1.1043 1.1004 1.0855 1.0872 1.0924 1.0892 1.0941 1.0958 1.1000 1.0979
irintensity: 0.1907 0.3713 0.4023 0.8433 0.1887 0.5566 2.1565 0.5468 0.3521 1.4277 5.7417 0.9787 0.4167 0.2227 0.0215 0.0672 1.6685 0.6997 0.6852 3.0421 5.2002 8.9201 0.4976 0.5015 3.7041 9.6908 5.3415 2.8717 3.8336 11.9854 1.3369 2.9987 3.9941 3.9385 16.1900 1.3757 6.5207 43.8808 10.8279 34.2717 33.9040 2.3438 62.0253 5.9362 54.6756 11.8229 11.9915 11.6911 0.0541 0.3075 10.8643 5.7715 104.2328 2.1341 15.0938 0.1001 2.4788 1.0746 10.5828 17.5087 35.3490 25.9167 8.3127 18.6779 11.5860 41.2003 4.6239 12.9716 3.3165 36.4874 4.8417 11.5828 6.8191 1.9872 43.1765 57.4966 6.3074 9.1351 8.1457 0.1057 2.0505 0.7300 35.1640 1.5987 30.1189 135.5739 46.4205 29.3420 50.5775 1.5019 44.4806 2.9529 11.4981 82.9152 3.8250 30.5971 6.4479 19.3581 25.9930 16.8658 12.2927 14.6881 1.8461 15.4497 57.3162 226.4606 41.0311 0.1386 26.2301 43.3773 76.8887 71.4163 228.7808 19.8516 32.3054 14.9258 31.0314 45.7175 43.7609 13.7227 2.3372 21.2756 63.5390 45.1176 2.1564 3.9743 3.2334 10.2986 5.1282 21.7875 20.6504 6.4359
temp: 298.150 k
press: 1.00000 atm
elementType: 17 8 7 7 7 6 6 6 6 6 6 6 6 6 6 6 6 6 6 6 6 6 6 6 1 1 1 1 1 1 1 1 1 1 1 1 1 1 1 1 1 1 1 1 1 1
symmnumber: 1
zpe: 976363.9 jmol-1
zpe.correction: 0.371877 hartree
zpe.thermalcorrener: 0.394317 hartree
zpe.thermalcorrenthalpy: 0.395261 hartree
zpe.thermalcorrgfe: 0.316436 hartree
zpe.sumelectzpe: -1434.960910 hartree
zpe.sumelectthermal: -1434.938471 hartree
zpe.sumelectthermalent: -1434.937527 hartree
zpe.sumelectthermalfe: -1435.016352 hartree
dipole: 1.5866 -0.6478 -0.7797
dipole: 1.8828
quadrupole: -149.3192 -143.2522 -146.3713
quadrupole: -8.5764 -5.1439 -1.6101
quadrupole: -3.0049 3.0620 -0.0571 -8.5764 -5.1439 -1.6101
hfenergy: -1435.3327875 hartree
pointgroup: C01 [X(C19H22Cl1N3O1)]
dipole: 0.6492756 -0.1713231 -0.3127276 debye
polarizability: 324.8370233|3.9994062|230.005678|17.0825945|12.5371214|170.2258931 unknown
InChI: InChI=1S/C19H22ClN3O/c1-22(2)11-6-12-24-19-17-9-3-4-10-18(17)23(21-19)14-15-7-5-8-16(20)13-15/h3-5,7-10,13H,6,11-12,14H2,1-2H3
charge 0 multiplicity 1
46 atoms
Cl -6.886577 -2.372702 -0.698458
O  2.23105 0.921039 0.252595
N  -1.036448 0.335336 -0.956884
N  0.312112 -0.069458 -0.81315
N  6.749917 -1.083613 0.295717
C  -1.277552 1.549327 -0.323327
C  -0.028607 1.974591 0.246271
C  4.458919 -0.025881 0.245002
C  -1.970553 -0.536007 -1.66452
C  0.897696 0.923721 -0.097176
C  5.388738 -1.137128 -0.28856
C  3.019842 -0.247837 -0.219825
C  -2.910649 -1.319845 -0.745807
C  -2.45638 2.325507 -0.195207
C  0.056324 3.200924 0.951121
C  -2.349105 3.539109 0.508702
C  -1.110679 3.976461 1.075399
C  7.494977 0.138542 -0.070279
C  7.52258 -2.304422 -0.015319
C  -4.27819 -1.453658 -1.086395
C  -2.418947 -1.943592 0.428285
C  -5.122059 -2.210134 -0.250725
C  -3.286642 -2.692366 1.251484
C  -4.654874 -2.836404 0.918785
H  4.502748 -0.021444 1.349022
H  4.787918 0.968887 -0.106841
H  -1.344816 -1.232828 -2.249921
H  -2.559847 0.064707 -2.383142
H  5.418997 -1.08705 -1.411299
H  4.957444 -2.123388 -0.02486
H  2.57782 -1.16977 0.206206
H  2.938881 -0.306424 -1.32335
H  -3.41341 1.996189 -0.611643
H  1.006658 3.52753 1.384459
H  -3.239961 4.165632 0.6307
H  -1.078759 4.928569 1.615639
H  7.642187 0.248656 -1.176275
H  8.491005 0.114803 0.406342
H  6.969856 1.035707 0.29746
H  6.975759 -3.193896 0.345792
H  8.49704 -2.269009 0.503932
H  7.72059 -2.4406 -1.110048
H  -4.680073 -0.976113 -1.986803
H  -1.361715 -1.832889 0.692034
H  -2.905021 -3.171547 2.159401
H  -5.334191 -3.414232 1.551761
