program: Gaussian 09
title: 000200544
version: EM64L-G09RevD.01
frameworkgroup: C1[X(C22H29ClN2O3)]
method: RPBEPBE
basis: SDD
operation: Freq
keyword: #p
keyword: freq=noraman
keyword: PBEPBE/SDD
title: #p freq=noraman PBEPBE/SDD
converged: YES YES NO NO
title: Mulliken charges:
elementType: Cl O O O N N C C C C C C C C C C C C C C C C C C C C C C H H H H H H H H H H H H H H H H H H H H H H H H H H H H H
charge: -0.066503 -0.275493 -0.243304 -0.240251 -0.078825 -0.164722 -0.373953 -0.349774 -0.417239 -0.410567 -0.342463 -0.386235 0.533918 -0.397093 -0.302732 -0.298417 -0.340020 -0.222094 -0.243761 -0.247197 0.375476 -0.524542 -0.382844 0.244185 -0.324937 0.193843 -0.536942 -0.538062 0.208588 0.189316 0.197377 0.201737 0.201466 0.226038 0.231368 0.213136 0.180983 0.203166 0.207852 0.198331 0.208732 0.213527 0.203393 0.201965 0.249476 0.251398 0.226102 0.233075 0.265402 0.246004 0.238721 0.245168 0.220867 0.220620 0.244548 0.216152 0.216039
chargesum: 0.00000
title: Mulliken charges with hydrogens summed into heavy atoms:
elementType: Cl O O O N N C C C C C C C C C C C C C C C C C C C C C C
charge: -0.066503 -0.275493 -0.243304 -0.240251 -0.078825 -0.164722 0.023951 0.049340 0.010264 0.033936 0.041686 0.019948 0.533918 0.025166 0.102625 -0.298417 -0.090543 0.029304 -0.017659 -0.014122 0.375476 -0.259139 -0.136840 0.244185 -0.086216 0.193843 0.149713 0.138677
polarizability: 4.14638599e+02 1.12263627e+01 2.28585103e+02 -1.63154003e+01 -7.61386502e-01 2.12472330e+02
1716.lowfreq: -22.8491 -6.6871 -1.5007 -0.0017 -0.0013 0.0007 2.5014 8.9753 14.3925
frequency: -15.7865 8.5692 14.0198 30.0457 44.8150 57.4394 70.7632 75.2274 79.8090 91.7718 104.6916 113.2284 119.9382 139.9589 151.0970 151.9543 171.5661 182.2798 204.1345 207.2328 236.4287 253.8810 254.3959 258.7288 275.1789 282.3877 298.2706 324.1555 347.2805 369.1329 371.7661 380.0393 401.0811 410.6786 447.1082 457.5795 465.6286 475.8414 479.1816 493.5330 546.0637 549.0231 577.0989 596.0022 614.1488 622.7045 658.2197 711.0582 714.2773 726.8060 731.9152 732.0899 749.8715 752.0610 770.3824 778.3122 812.0452 840.5028 849.2960 850.1345 885.0939 887.5790 921.4140 923.1546 928.8487 952.2288 969.5580 980.0869 987.9240 999.5027 1007.7249 1012.6899 1039.6846 1048.2119 1052.6810 1056.4292 1066.0740 1087.4675 1098.9644 1112.2282 1112.5758 1119.6610 1120.8675 1127.6413 1140.1320 1145.3353 1147.0791 1159.2275 1161.8463 1171.7176 1172.1792 1195.2610 1205.7919 1207.9946 1235.1950 1246.6041 1253.7108 1263.2879 1267.6618 1270.1102 1279.2017 1282.2770 1291.3744 1303.9698 1329.8509 1339.4949 1344.7254 1356.5429 1366.4403 1369.7523 1377.4017 1378.5834 1394.9804 1395.8163 1418.8261 1427.9945 1435.3270 1446.9561 1450.9570 1454.1819 1460.0521 1464.4757 1465.8025 1466.7812 1468.4352 1470.9242 1471.7495 1473.5054 1479.7334 1482.3301 1491.6099 1504.8520 1559.5040 1594.4328 1605.9576 1615.7865 2841.8346 2859.3393 2871.7082 2901.3314 2921.8096 2939.9370 2949.7673 2956.7465 2975.9192 2991.5096 2995.4867 3004.9525 3029.0743 3031.9543 3033.5727 3043.5925 3049.9243 3053.0848 3062.8713 3097.6979 3121.3580 3124.6773 3132.7059 3150.2283 3152.5332 3160.1108 3173.6747 3174.3523 3176.4733
redmass: 4.4869 5.1594 5.2849 6.0682 4.9685 4.5601 1.8973 4.2806 3.5850 3.2362 3.3132 4.4023 3.9986 2.2753 4.1099 3.9190 3.5967 3.8382 1.8605 5.1200 4.4970 1.3863 1.8733 4.7453 1.6887 2.6471 3.2765 2.7553 4.6004 3.2534 4.3110 5.5168 2.3149 5.7862 3.3715 3.0758 3.1952 5.1739 4.7872 3.7038 5.0323 3.5353 5.7346 3.9979 3.4927 2.8911 4.0955 3.7466 7.0454 2.5755 5.0138 4.1313 1.1114 1.2904 3.3646 1.5611 1.1914 1.4214 1.6924 1.5252 1.3851 6.2988 2.7314 1.6897 1.3368 1.9203 1.3244 7.0667 7.9183 2.9443 5.5210 3.5717 2.5055 2.2237 2.8625 2.3951 2.0006 2.0859 2.6360 1.2620 1.2614 1.9820 2.0647 2.4170 2.4127 1.4415 2.5049 1.3926 1.5567 1.5114 1.2304 1.2214 1.6575 2.3933 1.4893 1.2537 1.2776 2.6940 1.4894 1.9179 1.2783 1.1196 1.2756 1.3012 1.3490 1.3062 1.6046 1.6930 2.5687 1.5688 1.6342 1.6761 2.1080 1.9589 2.4379 2.4497 1.1852 1.5295 1.0840 1.0950 1.1437 1.1017 1.0509 1.0498 1.0757 1.1234 1.0865 1.0634 2.5316 1.1091 1.1317 2.3792 5.9360 8.3032 6.8562 6.5857 1.0701 1.0709 1.0694 1.0686 1.0710 1.0548 1.0335 1.0331 1.0601 1.0607 1.1048 1.0860 1.0925 1.0986 1.1034 1.1037 1.0895 1.0911 1.1047 1.0901 1.0985 1.0992 1.0856 1.0892 1.0869 1.0943 1.0938 1.1004 1.0920
irintensity: 0.1783 0.1061 0.0216 0.1913 0.6877 1.7024 0.8073 1.1798 5.5331 7.0644 1.2283 0.1842 0.4794 0.6116 1.3365 0.5317 6.2728 4.0916 2.5837 0.3837 4.7622 1.0490 2.8000 3.3187 0.5871 1.1700 7.3510 4.7817 0.5803 1.0748 3.4739 0.1703 3.2915 7.6858 7.3299 2.1297 0.4962 6.7761 0.3042 1.3847 5.1009 3.9422 0.2868 3.3184 8.4899 2.9196 22.5669 4.1870 30.6031 0.1045 12.4507 10.9895 25.4205 73.7509 9.2005 42.1088 1.2300 0.3321 42.8050 2.2761 0.7061 8.4791 28.8323 17.8262 2.7290 8.2499 0.2698 29.7363 64.2642 81.7283 78.2316 37.6046 54.9259 6.5438 2.4692 16.0277 2.7374 1.2419 3.7848 0.0531 0.3977 3.3931 56.2920 150.3598 72.9739 22.0407 20.3946 31.1654 6.2141 150.8137 67.7910 10.5323 3.3639 209.6310 90.0492 10.3059 23.9691 45.8682 4.7122 38.4079 8.4344 6.8770 18.4973 15.7495 2.6405 8.1043 11.2891 4.9291 32.0466 0.3813 62.8901 6.7434 17.0435 48.6808 11.7811 12.0966 27.6513 41.4511 6.5997 13.1371 77.5324 3.7851 9.6258 17.1521 1.7942 68.5495 33.4130 45.8193 118.5131 7.7041 41.6958 221.3301 2.3021 35.7791 84.4184 84.9731 59.7211 66.3127 98.3422 72.4797 96.2583 32.2478 88.4824 53.8186 12.4886 33.1050 26.1515 22.8137 23.1711 30.3574 54.0669 50.5544 52.0826 21.0477 89.0624 6.4858 25.5786 26.8823 6.0918 9.2306 17.9187 16.9699 12.1548 15.4284 0.8292
temp: 298.150 k
press: 1.00000 atm
elementType: 17 8 8 8 7 7 6 6 6 6 6 6 6 6 6 6 6 6 6 6 6 6 6 6 6 6 6 6 1 1 1 1 1 1 1 1 1 1 1 1 1 1 1 1 1 1 1 1 1 1 1 1 1 1 1 1 1
symmnumber: 1
zpe: 1236478.6 jmol-1
zpe.correction: 0.470950 hartree
zpe.thermalcorrener: 0.498421 hartree
zpe.thermalcorrenthalpy: 0.499365 hartree
zpe.thermalcorrgfe: 0.409958 hartree
zpe.sumelectzpe: -1648.782745 hartree
zpe.sumelectthermal: -1648.755274 hartree
zpe.sumelectthermalent: -1648.754330 hartree
zpe.sumelectthermalfe: -1648.843737 hartree
dipole: 1.1606 0.1331 -1.9310
dipole: 2.2569
quadrupole: -187.1781 -157.8566 -174.1010
quadrupole: -5.4398 -10.5760 -2.6559
quadrupole: -14.1329 15.1887 -1.0558 -5.4398 -10.5760 -2.6559
hfenergy: -1649.2536951 hartree
pointgroup: C01 [X(C22H29Cl1N2O3)]
dipole: 0.4633823 -0.1364863 0.7450138 debye
polarizability: 414.744924|-14.1437957|228.7434997|12.946856|1.0170227|212.2076073 unknown
InChI: InChI=1S/C22H29ClN2O3/c1-26-21-10-9-18(17-22(21)27-2)28-16-6-5-11-24-12-14-25(15-13-24)20-8-4-3-7-19(20)23/h3-4,7-10,17H,5-6,11-16H2,1-2H3
charge 0 multiplicity 1
57 atoms
Cl 6.605819 -0.713029 -2.564441
O  -3.714193 0.866475 -0.152691
O  -8.565009 1.111746 -0.399405
O  -8.841292 -1.464578 0.170598
N  2.533005 0.742336 0.435355
N  5.36292 0.163763 0.203251
C  3.562553 1.745169 0.802461
C  3.048198 -0.131738 -0.64887
C  4.85645 1.053969 1.269183
C  4.338375 -0.836055 -0.203201
C  1.225365 1.367047 0.116137
C  0.048782 0.370639 0.175675
C  6.727152 -0.21667 0.233686
C  -1.310209 1.072934 -0.046671
C  -2.482025 0.096473 0.079002
C  7.429057 -0.675149 -0.923143
C  7.504625 -0.112062 1.429241
C  8.784517 -1.044762 -0.894908
C  8.871437 -0.453713 1.466085
C  9.519721 -0.937037 0.308203
C  -4.938018 0.175496 -0.049269
C  -6.089416 0.973824 -0.273056
C  -5.069242 -1.194475 0.250653
C  -7.374707 0.406239 -0.195461
C  -6.367015 -1.763377 0.328967
C  -7.521869 -0.988091 0.112383
C  -8.449377 2.536253 -0.71593
C  -9.014204 -2.880579 0.489538
H  3.172115 2.368364 1.628762
H  3.810019 2.420815 -0.055629
H  3.257651 0.453286 -1.579987
H  2.291193 -0.899522 -0.887292
H  4.640112 0.490928 2.207866
H  5.617558 1.823599 1.488137
H  4.7264 -1.452612 -1.027432
H  4.105548 -1.502609 0.658688
H  1.23917 1.869099 -0.886593
H  1.045609 2.161576 0.866967
H  0.069577 -0.125821 1.165539
H  0.178158 -0.424722 -0.585257
H  -1.444927 1.884431 0.694392
H  -1.34214 1.542873 -1.048552
H  -2.508808 -0.3581 1.092156
H  -2.403961 -0.719057 -0.671421
H  7.013032 0.223315 2.347456
H  9.266294 -1.385758 -1.816258
H  9.424638 -0.358046 2.406937
H  10.578141 -1.214646 0.327696
H  -5.940959 2.031655 -0.503856
H  -4.197311 -1.830168 0.424173
H  -6.45856 -2.828049 0.563317
H  -9.485189 2.885811 -0.836158
H  -7.887811 2.69604 -1.657344
H  -7.958417 3.093671 0.105971
H  -10.102133 -3.042961 0.48799
H  -8.601774 -3.124653 1.489105
H  -8.538928 -3.52959 -0.273145
