program: Gaussian 09
title: 000200509
version: EM64L-G09RevD.01
frameworkgroup: C1[X(C20H32O2)]
method: RPBEPBE
basis: SDD
operation: Freq
keyword: #pfreq=noraman
keyword: PBEPBE/SDD
title: #p freq=noraman PBEPBE/SDD
converged: YES YES NO NO
title: Mulliken charges:
elementType: O O C C C C C C C C C C C C C C C C C C C C H H H H H H H H H H H H H H H H H H H H H H H H H H H H H H H H
charge: -0.253862 -0.235151 -0.385432 -0.384837 -0.385042 -0.382099 -0.380837 -0.372775 -0.375935 -0.353418 -0.406739 -0.356619 -0.321566 -0.696415 0.358190 -0.355583 -0.378144 0.305107 -0.345963 -0.334806 0.112884 -0.790300 0.195510 0.193997 0.192496 0.193991 0.194838 0.192961 0.191823 0.193008 0.198049 0.196483 0.189898 0.188886 0.191529 0.193707 0.187568 0.188137 0.217400 0.218366 0.194814 0.194600 0.211257 0.210497 0.209795 0.215254 0.209732 0.250492 0.255533 0.238857 0.279429 0.235172 0.235178 0.260083
chargesum: 0.00000
title: Mulliken charges with hydrogens summed into heavy atoms:
elementType: O O C C C C C C C C C C C C C C C C C C C C
charge: -0.253862 -0.235151 0.004074 0.001650 0.002757 0.002733 0.013696 0.006008 0.009301 0.022287 0.029026 0.032796 0.100188 -0.061634 0.358190 -0.105091 -0.122611 0.305107 -0.107105 -0.055376 0.112884 -0.059867
polarizability: 3.59212971e+02 -7.41095954e+00 2.03162847e+02 2.45207367e+00 1.46216926e+00 1.46589619e+02
1716.lowfreq: -0.0021 0.0010 0.0012 2.5912 4.0101 10.3806 16.9763 17.7315 26.3086
frequency: 10.1518 17.0277 26.0718 36.9278 46.5067 51.4065 65.9671 73.0134 83.5635 93.7601 100.2124 113.7400 117.6084 128.6433 137.3486 142.3842 150.8030 153.3871 157.3694 164.7974 201.0608 225.6332 237.3500 264.1953 284.7629 324.2818 342.8731 402.4689 410.1636 415.2082 459.1370 472.3557 493.9455 495.1096 508.8806 573.8251 591.3676 628.2033 687.5503 720.5370 722.6211 728.3642 739.8326 741.7781 764.6710 797.7475 804.6477 814.6024 842.3497 855.5161 887.4686 890.3097 941.3553 941.8885 948.9717 959.7155 982.1169 990.8620 992.8891 996.3533 998.6154 1019.3580 1026.1551 1029.6772 1036.9365 1055.5032 1070.7163 1072.2542 1077.8717 1080.4593 1082.2585 1099.8178 1117.4106 1125.7808 1147.8389 1178.1893 1181.7466 1202.9235 1204.3986 1228.9277 1232.9315 1234.7821 1254.5733 1262.3262 1275.7617 1278.6675 1280.5067 1283.9946 1289.0244 1291.1444 1291.8688 1298.8181 1300.6849 1300.9057 1314.7965 1336.3343 1351.1642 1354.8166 1357.6283 1359.8353 1365.4236 1374.0560 1385.8592 1387.7489 1430.9338 1447.8706 1460.1490 1460.2422 1463.4590 1463.7430 1464.4852 1466.9492 1468.9683 1472.1120 1475.7798 1476.5004 1480.7829 1485.0339 1488.3298 1489.9278 1499.2045 1558.3836 1594.5990 1619.7901 2949.1060 2949.3552 2949.9399 2951.3316 2951.9704 2954.6058 2956.2859 2961.1918 2965.9666 2968.4405 2971.4055 2982.4087 2984.2821 2985.5302 2990.0070 2995.6164 2995.7435 3003.4314 3009.6944 3014.4487 3025.4879 3035.4025 3042.9546 3064.4150 3067.7870 3068.9060 3070.4378 3124.0219 3141.8617 3150.5608 3167.0005 3171.7902
redmass: 4.3834 4.4511 4.0088 1.9523 4.1533 3.7892 1.8820 2.8303 3.1563 4.0406 1.7658 3.0641 5.2714 2.0030 2.4447 1.0486 2.1562 3.8821 2.0136 2.3372 3.9469 1.1330 4.3594 3.7115 5.9154 3.4763 4.3352 3.3307 3.5871 2.9645 4.1821 3.3314 3.0457 3.4980 3.3555 4.5638 2.3125 6.9750 5.1744 1.0587 1.0671 1.0822 3.4568 1.1118 1.1350 1.1879 6.5495 1.3275 1.2052 1.4759 1.8996 1.2179 1.2175 2.3815 1.3413 6.0438 4.8915 1.1515 4.8716 1.3435 2.8911 3.9107 1.8051 1.0677 3.4952 3.1819 2.4690 2.5661 2.5028 2.0923 2.1599 2.5778 1.2812 3.1672 1.3982 1.2726 1.8487 1.5556 1.2777 1.4040 2.6888 1.3854 1.3083 1.2991 1.1993 1.0405 3.8539 1.0482 1.3065 1.1074 1.1107 1.0982 1.1499 1.2613 1.3413 1.4051 1.5056 1.7063 1.6439 1.6215 1.4761 2.0530 1.9603 1.2175 4.3071 1.1041 1.0747 1.0735 1.0661 1.0760 1.0498 1.0737 1.0830 1.0932 1.0504 1.0895 1.1038 1.1087 1.1059 1.1319 2.1778 6.5923 7.8367 6.3828 1.0587 1.0585 1.0560 1.0588 1.0593 1.0588 1.0593 1.0591 1.0587 1.0585 1.0366 1.0962 1.0374 1.0972 1.0986 1.0593 1.1005 1.1026 1.1059 1.1047 1.1051 1.1051 1.1046 1.1052 1.1007 1.0971 1.0993 1.0990 1.0878 1.0881 1.0950 1.0971
irintensity: 0.7835 0.5770 0.7615 0.3054 0.3091 0.1481 0.9459 1.2858 0.1403 0.0354 0.3108 0.0907 0.3021 0.9450 0.1829 0.1965 2.0573 0.6454 0.0538 2.7868 2.7953 0.0070 2.8243 1.2411 1.0255 1.4211 0.8576 0.6550 1.5337 0.0136 0.4805 0.2188 6.5336 0.3396 0.1004 42.7293 14.2875 0.7046 4.1434 17.8874 0.6721 7.2914 0.2512 0.3376 4.7440 2.5518 9.3925 22.5490 0.0343 57.4398 5.2560 0.7307 0.4744 79.8148 0.3709 54.3190 1.2088 0.2548 19.5126 0.8920 3.6772 5.3696 1.2751 0.0303 1.9666 3.9077 2.9112 2.2747 2.2747 0.0440 0.3134 16.8039 16.1664 10.1939 0.9831 223.9764 0.2362 0.2632 23.4106 0.0108 217.3128 33.2727 0.0038 3.5380 0.0619 0.1441 325.0677 0.6812 1.9191 0.0821 0.0622 0.2600 0.8066 4.0543 0.2276 0.0515 1.2960 0.1218 0.1621 0.3146 34.7907 33.5595 12.4027 11.1508 49.7611 36.9169 0.0112 0.0231 0.0397 0.0687 20.0571 0.2422 2.1651 7.4405 11.0827 3.4411 10.9287 2.2503 13.0479 42.6043 18.9480 184.4615 160.3309 157.6202 0.0548 0.4603 14.7164 1.6401 0.7631 8.2259 7.3695 3.8277 74.4616 240.6256 37.9177 0.0652 4.4586 0.1867 0.4347 37.1206 0.9820 1.4941 20.2026 0.2936 4.5931 2.0656 241.0298 96.7797 101.4095 15.3031 56.3963 20.2199 11.0216 0.1165 14.5358 6.0588
temp: 298.150 k
press: 1.00000 atm
elementType: 8 8 6 6 6 6 6 6 6 6 6 6 6 6 6 6 6 6 6 6 6 6 1 1 1 1 1 1 1 1 1 1 1 1 1 1 1 1 1 1 1 1 1 1 1 1 1 1 1 1 1 1 1 1
symmnumber: 1
zpe: 1243175.9 jmol-1
zpe.correction: 0.473501 hartree
zpe.thermalcorrener: 0.499571 hartree
zpe.thermalcorrenthalpy: 0.500515 hartree
zpe.thermalcorrgfe: 0.412557 hartree
zpe.sumelectzpe: -930.044443 hartree
zpe.sumelectthermal: -930.018373 hartree
zpe.sumelectthermalent: -930.017429 hartree
zpe.sumelectthermalfe: -930.105387 hartree
dipole: 5.2041 3.0660 0.2201
dipole: 6.0441
quadrupole: -196.2966 -131.9824 -137.1713
quadrupole: -21.8698 -1.3549 0.0177
quadrupole: -41.1465 23.1677 17.9788 -21.8698 -1.3549 0.0177
hfenergy: -930.517944 hartree
pointgroup: C01 [X(C20H32O2)]
dipole: -2.0481882 -0.9788584 0.708102 debye
polarizability: 359.2429478|-5.7590104|184.734988|4.6141203|-26.5656156|164.987501 unknown
InChI: InChI=1S/C20H32O2/c1-3-4-5-6-7-8-9-10-11-12-17-22-20-15-13-19(14-16-20)18(2)21/h13-16H,3-12,17H2,1-2H3
charge 0 multiplicity 1
54 atoms
O  2.979302 0.917628 -0.460973
O  9.380445 0.40856 -0.217296
C  -4.571688 0.415792 -0.22153
C  -5.809665 -0.366562 0.271803
C  -3.233246 -0.191279 0.255867
C  -7.147475 0.232648 -0.217194
C  -1.996739 0.58125 -0.255534
C  -8.385277 -0.559298 0.261562
C  -0.657568 -0.036167 0.206776
C  -9.722954 0.033951 -0.235122
C  0.56987 0.737171 -0.328145
C  -10.959949 -0.765177 0.235138
C  1.88802 0.103166 0.117915
C  -12.291867 -0.167878 -0.268233
C  4.297258 0.533278 -0.213509
C  4.675699 -0.590496 0.56732
C  5.293198 1.356269 -0.807604
C  7.050735 -0.069017 0.158585
C  6.044061 -0.879388 0.744951
C  6.647386 1.055479 -0.62133
C  8.5124 -0.343364 0.322731
C  8.950125 -1.548784 1.153636
H  -4.641734 1.468587 0.12381
H  -4.581091 0.452208 -1.331114
H  -5.735283 -1.420747 -0.06895
H  -5.806078 -0.398469 1.381577
H  -3.217792 -0.218324 1.365616
H  -3.170453 -1.247252 -0.081568
H  -7.146057 0.272753 -1.326746
H  -7.22807 1.283943 0.130658
H  -2.053267 1.6349 0.088491
H  -2.019113 0.614701 -1.364665
H  -8.39062 -0.59636 1.371247
H  -8.301538 -1.611514 -0.083216
H  -0.609237 -1.092579 -0.131509
H  -0.630638 -0.061052 1.316282
H  -9.716321 0.076258 -1.344613
H  -9.812499 1.084092 0.114296
H  0.544554 0.766569 -1.43427
H  0.539072 1.786546 0.022349
H  -10.967098 -0.80588 1.343683
H  -10.868628 -1.814483 -0.113119
H  1.978042 0.100668 1.224084
H  1.97341 -0.940273 -0.250569
H  -12.423176 0.869301 0.094313
H  -13.159275 -0.759129 0.078882
H  -12.321321 -0.141469 -1.374019
H  3.923105 -1.233504 1.031886
H  4.971941 2.215395 -1.404113
H  6.322082 -1.749221 1.349667
H  7.43113 1.674883 -1.069648
H  8.552555 -2.490267 0.730713
H  8.583865 -1.470439 2.194368
H  10.049556 -1.594729 1.162381
