program: Gaussian 09
title: 000200537
version: EM64L-G09RevD.01
frameworkgroup: C1[X(C20H26NO2S)]
method: RPBEPBE
basis: SDD
operation: Freq
keyword: #p
keyword: freq=noraman
keyword: PBEPBE/SDD
title: #p freq=noraman PBEPBE/SDD
converged: NO YES NO NO
title: Mulliken charges:
elementType: S O O N C C C C C C C C C C C C C C C C C C C C H H H H H H H H H H H H H H H H H H H H H H H H H H
charge: 0.306213 -0.199734 -0.518581 -0.109417 -0.363262 -0.313204 -0.325598 -0.441300 -0.490349 -0.367883 -0.346355 0.191612 -0.037318 0.318731 -0.225751 -0.361139 -0.400115 -0.270197 -0.555876 -0.135122 -0.490129 -0.238400 -0.231666 -0.231921 0.254842 0.289197 0.266091 0.317062 0.271948 0.272514 0.315582 0.247006 0.257181 0.241967 0.266809 0.213576 0.212460 0.267964 0.241963 0.382170 0.244674 0.250694 0.248926 0.252923 0.232387 0.262323 0.282948 0.246415 0.245910 0.251227
chargesum: 1.00000
title: Mulliken charges with hydrogens summed into heavy atoms:
elementType: S O O N C C C C C C C C C C C C C C C C C C C C
charge: 0.306213 -0.199734 -0.136411 -0.109417 0.180778 0.269949 0.218863 0.121288 0.008800 0.112502 0.134070 0.191612 0.204645 0.318731 -0.225751 -0.116465 -0.149421 -0.021271 -0.070565 0.127201 -0.207182 0.008015 0.014244 0.019306
polarizability: 2.57957596e+02 -7.63649500e+00 2.66581200e+02 -4.67797654e+00 -5.53689633e+00 1.75330420e+02
1716.lowfreq: -16.6217 -0.0023 -0.0022 -0.0019 1.7411 8.5432 11.6112 30.2419 34.3764
frequency: -15.4402 29.8436 34.2866 57.0362 66.1457 76.7394 83.6229 95.9552 114.7307 132.6316 175.1934 180.5360 205.4771 218.9270 224.3449 254.1794 284.7116 289.5627 304.9323 311.7387 328.0637 339.3461 363.5629 391.8209 406.4926 418.1358 428.8852 432.7670 453.5523 485.5367 486.1183 517.3102 521.1326 549.4735 581.0506 599.1231 607.2598 614.5962 615.9755 669.1373 692.9418 710.7675 718.7458 721.2262 759.7127 786.0494 793.3561 803.2619 827.5283 833.4124 841.5519 849.4104 852.5295 865.5340 905.2780 919.3810 925.2875 940.3189 941.1878 968.7899 984.4968 989.4127 991.6849 994.7953 1005.7107 1010.0819 1011.7179 1019.9324 1028.3827 1035.4745 1047.3169 1056.2517 1081.1130 1082.0261 1087.8421 1090.3504 1098.8546 1131.2112 1143.9499 1170.2659 1179.2730 1189.3690 1194.0696 1197.0147 1229.7601 1247.3360 1262.0465 1266.9882 1278.4320 1281.8106 1300.1084 1311.4434 1315.2629 1329.7075 1339.8637 1342.8210 1347.6193 1354.5479 1371.1433 1378.2570 1384.4480 1395.7241 1404.8503 1434.7106 1435.5552 1439.3931 1445.0948 1461.6753 1464.9057 1469.5375 1472.4187 1477.8697 1481.0193 1502.2501 1531.2927 1589.6770 1608.4136 1656.4782 2971.6949 2976.5151 3016.3033 3018.8603 3022.8515 3024.2968 3031.8629 3079.7817 3090.8182 3092.7147 3094.7118 3095.4208 3102.5292 3102.9650 3107.0639 3118.8739 3126.2403 3138.6600 3150.6192 3159.5088 3163.5965 3175.0131 3191.0796 3209.0054 3239.8440 3556.8172
redmass: 6.7610 4.9524 4.2001 4.7413 4.5551 4.0920 3.6385 2.9803 5.0937 4.7469 3.7480 2.6248 3.7521 4.7790 7.0685 3.5412 1.9760 4.8935 1.3342 3.1050 4.1915 3.0180 1.9820 2.1122 2.8363 2.3848 3.6166 2.9197 2.4823 2.6682 2.9269 3.7364 3.0095 4.3250 2.3805 3.4378 2.0004 4.0029 5.8347 5.2698 6.7966 2.1156 1.1886 2.0531 1.9637 2.4253 2.8518 3.8242 3.3693 2.7924 1.5307 2.4509 2.5321 1.2553 3.0833 1.4010 2.3376 1.5214 1.4666 2.3778 2.1932 2.8463 1.8896 1.2599 1.3633 1.3499 2.1916 2.6116 2.2674 2.2010 1.9176 2.0284 2.6918 1.9363 1.7340 1.9360 2.3509 2.1615 2.6623 2.2948 1.0875 1.7502 1.2275 1.0853 1.3760 1.2878 1.3115 1.4334 1.1984 1.2051 1.1617 1.2257 1.3582 1.3825 2.0413 1.2181 1.2443 1.2290 1.4222 7.3752 1.2473 1.2957 1.2861 2.1227 1.1707 1.0900 1.1018 7.4931 1.0760 1.0828 1.0850 1.1176 2.1052 1.0837 5.2394 6.0355 6.0535 4.4470 1.0694 1.0682 1.0620 1.0633 1.0618 1.0619 1.0591 1.1011 1.0990 1.0948 1.0956 1.0656 1.1061 1.0976 1.1072 1.0956 1.0880 1.0864 1.0913 1.0954 1.0922 1.1014 1.0956 1.1144 1.1007 1.0664
irintensity: 0.1945 0.1004 0.3760 0.1085 0.3101 0.4768 0.0527 0.1282 4.5250 7.8572 2.9694 2.2262 1.2722 3.1412 2.4143 4.6805 16.4065 10.6029 55.8512 3.1377 13.2455 11.9372 11.0285 2.5146 1.4949 0.6454 8.7895 2.7454 1.7312 6.4521 0.5965 2.7570 11.7719 4.6470 17.6256 3.9520 1.4708 5.1399 0.3856 7.0395 0.8634 24.6331 85.0417 49.9072 86.7823 11.4824 5.5694 3.1883 30.4508 37.8984 20.8023 20.4931 13.8460 0.1555 3.3735 0.7529 11.6185 19.8341 7.1329 7.2228 57.1188 9.2819 7.6968 77.5479 0.5737 1.9190 17.6433 22.2824 10.1361 10.5665 16.9049 8.6624 13.8026 8.1553 14.1868 4.6726 20.7578 0.1318 1.5517 0.5917 1.4781 16.4636 5.6169 6.1318 20.2916 6.5166 12.2861 76.3482 0.8375 8.5045 12.0839 0.0516 3.2113 18.8728 12.3715 1.4930 2.4036 3.8916 5.9401 1.3267 4.2190 17.0965 4.0910 13.2966 17.9501 8.4134 21.1038 18.8010 16.3096 27.7022 23.2635 23.8649 7.3302 30.2293 3.4907 1.4541 0.2395 0.6586 25.8280 50.3296 2.5463 12.9138 43.6569 12.7694 8.4094 3.6060 16.1617 4.4575 4.8622 6.9621 31.3838 6.2932 9.4595 9.1126 7.3860 0.4830 5.1520 16.9424 7.2779 10.8428 1.6966 7.1767 1.9803 25.0601
temp: 298.150 k
press: 1.00000 atm
elementType: 16 8 8 7 6 6 6 6 6 6 6 6 6 6 6 6 6 6 6 6 6 6 6 6 1 1 1 1 1 1 1 1 1 1 1 1 1 1 1 1 1 1 1 1 1 1 1 1 1 1
symmnumber: 1
zpe: 1101144.1 jmol-1
zpe.correction: 0.419404 hartree
zpe.thermalcorrener: 0.441490 hartree
zpe.thermalcorrenthalpy: 0.442434 hartree
zpe.thermalcorrgfe: 0.368672 hartree
zpe.sumelectzpe: -1378.883364 hartree
zpe.sumelectthermal: -1378.861277 hartree
zpe.sumelectthermalent: -1378.860333 hartree
zpe.sumelectthermalfe: -1378.934096 hartree
dipole: 5.3102 -2.9983 1.4240
dipole: 6.2623
quadrupole: -100.8285 -121.5989 -133.5620
quadrupole: -9.6322 5.2001 -0.7484
quadrupole: 17.8346 -2.9358 -14.8989 -9.6322 5.2001 -0.7484
hfenergy: -1379.3027672 hartree
pointgroup: C01 [X(C20H26N1O2S1)]
dipole: -2.1235188 -0.1764076 1.2368092 debye
polarizability: 259.4884795|1.1964799|196.2413662|-9.9020781|38.2242382|244.1393712 unknown
InChI: InChI=1S/C20H26NO2S/c1-2-11-21(13-15-23-16-14-21)12-10-20(22,19-9-6-17-24-19)18-7-4-3-5-8-18/h2-9,17,22H,1,10-16H2
charge 1 multiplicity 1
50 atoms
S  3.893892 1.22021 0.261037
O  -4.322559 -0.920343 -1.898981
O  0.190338 1.627997 -0.294344
N  -2.278526 -0.461521 0.221464
C  -0.990196 -1.094996 0.827889
C  -2.05945 -0.121442 -1.275976
C  -3.375899 -1.550044 0.301883
C  -2.691843 0.82113 1.000839
C  0.161104 -0.190275 1.310569
C  -3.372684 0.19402 -2.001952
C  -4.636544 -1.174555 -0.491067
C  1.06542 0.540864 0.270754
C  -2.992065 0.573228 2.459463
C  1.533756 -0.413747 -0.847763
C  2.232186 1.200751 0.989457
C  2.207647 -1.617653 -0.508073
C  1.33651 -0.103338 -2.214391
C  2.207901 1.949343 2.16451
C  -4.187637 0.862197 3.031105
C  3.475734 2.533801 2.515566
C  4.479438 2.246446 1.604048
C  2.661003 -2.495958 -1.515638
C  1.797118 -0.979327 -3.224459
C  2.455285 -2.180816 -2.879306
H  -1.346594 -1.674566 1.697586
H  -0.626814 -1.811237 0.070403
H  -1.596521 -1.016479 -1.724483
H  -1.342105 0.715267 -1.310184
H  -3.6097 -1.708789 1.367962
H  -2.926765 -2.465219 -0.120218
H  -1.848883 1.519693 0.852311
H  -3.576161 1.236652 0.494551
H  0.814922 -0.879714 1.877097
H  -0.193832 0.552098 2.044319
H  -3.159503 0.307963 -3.076802
H  -3.84221 1.134454 -1.645195
H  -5.159935 -0.303715 -0.043867
H  -5.32873 -2.031589 -0.484341
H  -2.172854 0.210943 3.09515
H  0.759883 2.41812 -0.47844
H  2.413228 -1.8600 0.541616
H  0.83651 0.830659 -2.490074
H  1.307802 2.095506 2.767973
H  -4.349243 0.737139 4.10679
H  -5.033652 1.255241 2.452834
H  3.636168 3.143017 3.407548
H  5.525726 2.547101 1.618633
H  3.187164 -3.41552 -1.238727
H  1.649843 -0.718271 -4.27783
H  2.815628 -2.857229 -3.661144
