program: Gaussian 09
title: 000200559
version: EM64L-G09RevD.01
frameworkgroup: C1[X(C19H22F3NO)]
method: RPBEPBE
basis: SDD
operation: Freq
keyword: #p
keyword: freq=noraman
keyword: PBEPBE/SDD
title: #p freq=noraman PBEPBE/SDD
converged: YES YES NO NO
title: Mulliken charges:
elementType: F F F O N C C C C C C C C C C C C C C C C C C C H H H H H H H H H H H H H H H H H H H H H H
charge: -0.168894 -0.168184 -0.169219 -0.318047 -0.098933 0.061614 -0.274594 -0.404602 0.390014 0.474457 -0.717529 -0.372032 -0.410754 -0.449168 -0.359746 -0.617046 -0.613786 0.288540 -0.344014 -0.337227 -0.223854 -0.226608 -0.241226 0.251633 0.206983 0.214287 0.209013 0.212096 0.258115 0.218165 0.206775 0.253182 0.290286 0.234089 0.255123 0.226479 0.191781 0.223160 0.221124 0.190742 0.227879 0.259788 0.259787 0.229372 0.229440 0.231539
chargesum: 0.00000
title: Mulliken charges with hydrogens summed into heavy atoms:
elementType: F F F O N C C C C C C C C C C C C C C C C C C C
charge: -0.168894 -0.168184 -0.169219 -0.318047 -0.098933 0.268597 -0.060308 0.016507 0.390014 0.474457 -0.034474 -0.118851 -0.120469 -0.215079 -0.104624 0.024374 0.025960 0.288540 -0.084226 -0.077440 0.005518 0.002832 -0.009687 0.251633
polarizability: 2.45280559e+02 1.56091688e+01 2.28304479e+02 3.29600168e+00 5.81006582e+00 1.68584050e+02
1716.lowfreq: -6.0803 -0.0010 -0.0007 -0.0005 1.9049 4.0490 13.3592 16.5550 19.6437
frequency: 13.3170 16.3463 19.4489 26.1344 26.9069 38.0682 47.1992 56.5609 79.6002 103.0101 139.9355 159.9796 177.4148 189.5290 203.2469 214.6547 222.4601 226.6723 236.8895 275.2416 309.6208 330.5794 344.9667 362.6419 373.0571 384.4552 401.9908 403.5509 417.5029 433.9986 453.2409 488.0495 501.7825 515.6340 555.4572 567.9525 607.4705 615.1543 631.5209 636.7925 698.1574 705.8904 736.3115 769.8243 801.2382 819.1737 830.9332 852.9985 857.2501 862.5875 882.5664 899.9755 917.3485 930.0740 973.4388 979.2739 980.8975 989.9566 990.6568 995.2937 997.1277 999.9878 1020.9284 1025.8388 1030.5645 1035.1054 1040.6202 1058.2184 1079.7378 1081.5582 1093.5325 1129.5578 1137.6222 1146.2809 1173.2239 1176.7502 1185.9821 1196.6890 1206.9246 1214.8191 1263.1362 1267.4402 1278.4164 1279.3381 1287.9635 1309.0304 1322.0131 1335.6446 1339.8005 1368.3513 1372.6634 1380.8976 1386.1151 1406.9304 1420.8480 1442.2712 1442.6517 1462.2159 1463.0785 1468.9288 1472.3524 1477.1227 1478.6264 1480.6629 1487.1116 1505.1818 1584.0703 1594.4112 1610.5487 1624.3518 2854.1916 2863.1494 2886.8466 2929.9070 2974.2678 2979.4279 3018.9084 3027.0852 3034.2431 3076.9019 3078.6630 3084.0009 3086.5631 3111.9261 3126.7686 3137.9534 3139.9392 3149.1303 3157.8818 3165.0662 3166.5979 3189.6595
redmass: 5.0799 4.5102 4.2407 4.2951 3.9275 4.3204 4.2489 3.9344 4.2136 3.6894 5.0794 4.4332 3.8399 2.5460 1.6186 3.8163 1.1135 3.4676 1.2666 4.6128 3.3354 4.1435 6.2266 6.5763 6.5118 2.0161 2.8246 2.9051 3.0375 2.4752 5.8090 3.1370 3.7256 10.2068 4.6774 4.0700 6.9584 6.3466 7.1543 5.7061 5.0624 1.6719 4.4099 2.2338 2.6983 4.0977 3.0623 1.7793 1.2899 1.5214 2.2376 2.4775 1.4235 1.5324 2.3968 1.4449 2.4739 4.0949 5.3724 2.6610 2.1024 1.3929 6.7610 2.3242 2.6567 1.5706 2.0801 2.5560 1.4478 1.6107 1.3934 1.3901 1.7923 1.8181 1.0957 1.9024 1.1135 1.4818 2.1613 1.7368 2.2370 1.6606 1.6922 1.6709 2.4447 1.2608 1.4084 1.2857 1.3194 1.4789 1.2716 5.1178 6.3529 3.6049 1.1403 1.6369 1.3681 1.0568 1.0683 1.0532 1.0555 1.0711 1.0607 2.2519 1.0535 2.6735 7.5605 6.0878 6.0654 6.3141 1.0565 1.0581 1.0674 1.0812 1.0825 1.0362 1.0730 1.0732 1.0907 1.1006 1.1003 1.1005 1.0992 1.0882 1.0858 1.0909 1.0888 1.0960 1.0902 1.1014 1.0960 1.0946
irintensity: 0.0054 0.0588 0.0122 0.1274 0.0405 0.2537 0.5800 0.3454 1.4249 0.6261 0.8171 2.5985 1.2804 1.2790 0.4318 0.8104 0.8173 0.0676 0.6778 1.0846 2.0912 9.2957 11.6119 2.7131 3.1595 2.3429 0.2247 0.4832 3.2035 3.4485 0.9423 11.3367 12.4279 0.3041 2.6375 11.0709 1.8708 1.3048 0.1865 21.8579 4.2853 60.8086 3.9479 48.5434 69.4797 13.7484 5.6005 11.5716 1.8379 4.7183 28.7926 14.4090 3.0180 8.8579 111.3668 9.8494 122.4927 107.5631 38.4740 33.0409 57.3958 4.2386 122.2457 23.2798 31.0800 28.5910 48.9203 161.5255 16.6107 12.4938 18.0418 8.6627 8.2208 1.8763 0.8054 5.4344 1.2063 7.7550 1.9322 1.8984 22.1183 24.4754 208.3646 56.7109 145.3623 1.3235 3.6803 1.2984 6.2375 6.8347 38.3343 9.2734 1.1364 16.7455 3.0329 8.5043 5.8744 8.3295 10.1577 0.0407 14.7408 8.9179 28.6031 8.7302 12.7131 0.8123 1.2047 1.0183 3.0465 47.9330 68.3171 143.2211 116.8826 27.6819 27.5582 19.3867 41.9935 45.3711 22.9620 15.6261 43.4907 60.6692 13.6982 8.8612 0.1732 11.2800 5.0185 29.7645 2.0364 23.5351 3.6730 1.5027
temp: 298.150 k
press: 1.00000 atm
elementType: 9 9 9 8 7 6 6 6 6 6 6 6 6 6 6 6 6 6 6 6 6 6 6 6 1 1 1 1 1 1 1 1 1 1 1 1 1 1 1 1 1 1 1 1 1 1
symmnumber: 1
zpe: 963976.0 jmol-1
zpe.correction: 0.367159 hartree
zpe.thermalcorrener: 0.391309 hartree
zpe.thermalcorrenthalpy: 0.392253 hartree
zpe.thermalcorrgfe: 0.308040 hartree
zpe.sumelectzpe: -1164.917472 hartree
zpe.sumelectthermal: -1164.893322 hartree
zpe.sumelectthermalent: -1164.892378 hartree
zpe.sumelectthermalfe: -1164.976591 hartree
dipole: 5.8744 1.7257 0.2151
dipole: 6.1264
quadrupole: -164.6763 -129.0457 -138.1954
quadrupole: -4.7353 -4.8966 2.9959
quadrupole: -20.7039 14.9268 5.7771 -4.7353 -4.8966 2.9959
hfenergy: -1165.284631 hartree
pointgroup: C01 [X(C19H22F3N1O1)]
dipole: 2.2754645 -0.6047394 -0.5159231 debye
polarizability: 243.224488|-11.4150153|219.0031122|-14.5550545|23.439762|179.9414881 unknown
InChI: InChI=1S/C19H22F3NO/c1-14(13-23(2)3)24-18(15-7-5-4-6-8-15)16-9-11-17(12-10-16)19(20,21)22/h4-12,14,18H,13H2,1-3H3
charge 0 multiplicity 1
46 atoms
F  -5.771979 -0.488734 1.151256
F  -5.157791 1.37681 2.295117
F  -5.803963 1.531044 0.131107
O  1.314983 0.946419 -0.055296
N  4.892966 1.901896 0.406207
C  2.718787 1.058954 -0.528567
C  0.458633 0.041167 -0.840628
C  3.426521 1.833969 0.60476
C  -0.966206 0.201878 -0.300245
C  0.9637 -1.403175 -0.793022
C  2.827261 1.779401 -1.880502
C  -1.98009 -0.702369 -0.707492
C  -1.301899 1.266999 0.569671
C  1.293221 -2.092831 -1.983824
C  1.121016 -2.061617 0.453441
C  5.583451 0.643518 0.758338
C  5.50749 3.067645 1.073815
C  -3.630355 0.526303 0.604761
C  -3.306598 -0.542807 -0.264504
C  -2.626976 1.42989 1.023028
C  1.766117 -3.425506 -1.936708
C  1.596668 -3.388598 0.504447
C  1.918585 -4.075989 -0.691704
C  -5.050295 0.726927 1.040777
H  3.145224 0.037556 -0.607294
H  0.454179 0.370463 -1.904414
H  3.147861 1.359975 1.577971
H  3.024444 2.864554 0.616606
H  3.889432 2.028763 -2.053742
H  2.242581 2.717568 -1.862893
H  2.474809 1.157931 -2.723399
H  -1.72736 -1.542709 -1.363096
H  -0.514063 1.95354 0.88646
H  1.182207 -1.587166 -2.951924
H  0.872895 -1.524205 1.375852
H  5.165485 -0.201301 0.184383
H  5.503677 0.392283 1.846717
H  6.655055 0.725969 0.502881
H  6.580891 3.117593 0.815548
H  5.425749 3.037974 2.190125
H  5.027936 3.997263 0.719868
H  -4.081983 -1.249186 -0.576697
H  -2.879438 2.248754 1.703914
H  2.017271 -3.95066 -2.864992
H  1.714067 -3.890529 1.471476
H  2.285135 -5.107828 -0.651587
