program: Gaussian 09
title: 000200508
version: EM64L-G09RevD.01
frameworkgroup: C1[X(C17H26N2O2)]
method: RPBEPBE
basis: SDD
operation: Freq
keyword: #p
keyword: freq=noraman
keyword: PBEPBE/SDD
title: #p freq=noraman PBEPBE/SDD
converged: YES YES NO NO
title: Mulliken charges:
elementType: O O N N C C C C C C C C C C C C C C C C C H H H H H H H H H H H H H H H H H H H H H H H H H H
charge: -0.296658 -0.212968 -0.117866 -0.063076 -0.364139 -0.358536 -0.390896 -0.372295 -0.143347 -0.730917 -0.613927 0.217359 0.075433 0.380678 0.350408 0.491855 -0.618329 -0.566691 -0.825658 -0.811116 -0.818210 0.202638 0.244354 0.204719 0.190297 0.190967 0.208371 0.205293 0.186183 0.239082 0.225415 0.225716 0.250568 0.223272 0.187873 0.221758 0.238188 0.236880 0.251113 0.251315 0.220405 0.221335 0.241103 0.239388 0.226411 0.232005 0.224245
chargesum: 0.00000
title: Mulliken charges with hydrogens summed into heavy atoms:
elementType: O O N N C C C C C C C C C C C C C C C C C
charge: -0.296658 -0.212968 -0.117866 -0.063076 0.082852 0.036479 0.008442 0.019181 0.095736 -0.029218 0.018977 0.217359 0.075433 0.380678 0.350408 0.491855 -0.380141 -0.329811 -0.102825 -0.109290 -0.135549
polarizability: 2.63318384e+02 -1.45163780e+00 2.07094183e+02 -1.28897742e-02 -8.60568437e+00 1.48458078e+02
1716.lowfreq: -22.7577 -18.9850 -7.3286 -0.0006 -0.0005 0.0005 10.4722 18.1748 23.1448
frequency: -22.5314 11.0468 23.0188 36.9012 57.8527 67.2083 76.8133 113.9208 128.8165 141.0816 145.8675 174.2604 183.3609 190.4813 214.1487 221.4166 225.5529 241.9850 263.3522 266.3432 271.8116 300.6699 314.5142 322.7548 353.1816 361.2187 369.0637 391.4813 461.3292 482.5752 490.8800 514.4160 522.7803 552.1089 563.0646 570.4065 614.2944 668.8971 691.9973 715.3847 745.1702 752.2751 767.7824 832.8883 851.3078 865.5018 891.0894 920.3939 939.2612 944.2251 952.3337 1008.8230 1012.3584 1017.2341 1018.3324 1043.9886 1044.3363 1046.2784 1047.6490 1051.2700 1056.5198 1062.3153 1076.8978 1080.9030 1101.5251 1115.8636 1119.3202 1143.2716 1146.4992 1159.6574 1192.8711 1193.8428 1218.6278 1258.4996 1279.1341 1283.6198 1309.0481 1320.5597 1325.5862 1327.7779 1343.7036 1367.9631 1370.6522 1374.0984 1379.4200 1385.0701 1394.7698 1397.1461 1399.6670 1416.4899 1429.5113 1438.3252 1450.8489 1455.7021 1459.1586 1463.6930 1464.1655 1468.9735 1469.4523 1470.8090 1474.3840 1478.4182 1480.0110 1481.1020 1486.0136 1493.9868 1610.0249 1615.2852 1648.6936 2842.7963 2846.4756 2863.9852 2880.3680 2899.1845 2975.1264 2978.5163 2980.4039 2989.8996 3017.5580 3024.0431 3029.1912 3033.4001 3041.2915 3053.2950 3058.9502 3059.7159 3060.2856 3075.7323 3082.1233 3083.4318 3090.9096 3091.6411 3101.8096 3117.6241 3122.3196
redmass: 1.0525 4.0089 3.6704 3.1827 3.9264 4.8606 4.1103 1.0308 4.1173 3.5546 1.0740 2.8422 2.8629 3.2168 1.4355 1.1548 2.8871 1.7940 2.5863 2.4812 2.2833 2.7317 3.3196 3.7979 3.6947 2.9556 3.6723 2.3071 3.8491 2.8769 3.6015 3.0822 3.8824 3.8099 4.1560 3.9047 2.5642 3.6839 4.3998 3.8653 3.9767 3.4432 3.6864 3.7561 1.5342 1.3297 1.3138 1.9254 2.2586 2.4900 3.3576 2.3886 2.4736 1.5954 1.6920 1.5643 1.7633 1.7163 1.5555 1.5960 2.2111 1.8868 1.8706 1.8367 3.1252 1.6882 3.4182 2.6341 2.7200 2.5443 1.4797 1.1119 2.1336 1.3690 1.6536 1.5045 1.3447 1.4785 1.3234 6.3388 1.3065 1.4093 1.4210 6.2744 1.4425 1.2220 1.2490 1.2443 1.2561 2.6500 1.1665 1.9719 1.0807 1.0843 1.0672 1.0541 1.0501 1.0918 1.0817 1.0513 1.0964 1.0887 1.0575 1.0533 1.1907 1.3579 6.9291 6.4855 10.0897 1.0699 1.0646 1.0622 1.0685 1.0688 1.0373 1.0377 1.0375 1.0357 1.0728 1.0888 1.0902 1.0894 1.0853 1.0973 1.0910 1.0963 1.0954 1.1009 1.0994 1.0987 1.1004 1.0998 1.0998 1.0913 1.0919
irintensity: 0.4777 0.0926 0.0280 0.0949 0.6752 0.4936 3.5669 0.7594 0.8936 2.9828 0.8645 1.3720 2.4977 1.0190 0.4410 0.0786 0.0905 1.4280 5.5038 1.3014 2.8555 1.7367 1.4267 3.3233 4.5505 1.0195 13.0844 0.9719 7.8466 0.4447 1.8930 0.0252 4.0128 2.5063 0.6667 1.2659 3.6125 6.8230 5.2498 1.2079 9.8595 15.9650 9.3109 5.9833 0.6285 26.8517 0.1242 1.8056 2.0988 49.7637 8.3626 46.0928 50.8639 3.6310 8.8490 0.5180 5.3744 19.6237 4.0135 19.8715 156.6752 82.5661 13.9966 54.7730 190.3280 57.7744 41.3213 49.0562 26.3840 18.1178 19.1418 0.6756 7.2989 0.6508 23.0169 16.0840 4.5355 20.5284 11.0006 3.3861 6.4181 2.5654 4.0638 2.9132 15.7667 32.0067 13.2439 12.8926 6.5123 1.7350 0.8788 2.9928 0.6748 5.1638 27.0325 19.9820 9.3220 12.0974 23.5704 17.7053 7.3220 1.6726 7.0678 10.1996 25.3216 72.6425 10.2074 9.0053 119.2031 68.8328 49.1963 145.2772 118.2843 137.7603 45.3384 23.5568 20.5689 22.8075 47.6843 48.5953 70.4679 19.7636 16.3586 20.9264 11.4047 14.2813 17.5348 34.3511 34.9058 18.3773 13.6180 23.8834 18.7134 25.4090 14.3301
temp: 298.150 k
press: 1.00000 atm
elementType: 8 8 7 7 6 6 6 6 6 6 6 6 6 6 6 6 6 6 6 6 6 1 1 1 1 1 1 1 1 1 1 1 1 1 1 1 1 1 1 1 1 1 1 1 1 1 1
symmnumber: 1
zpe: 1049177.1 jmol-1
zpe.correction: 0.399610 hartree
zpe.thermalcorrener: 0.421787 hartree
zpe.thermalcorrenthalpy: 0.422731 hartree
zpe.thermalcorrgfe: 0.346917 hartree
zpe.sumelectzpe: -921.722601 hartree
zpe.sumelectthermal: -921.700425 hartree
zpe.sumelectthermalent: -921.699480 hartree
zpe.sumelectthermalfe: -921.775295 hartree
dipole: -0.4282 -0.1642 -1.5166
dipole: 1.5844
quadrupole: -115.5111 -116.5460 -131.9945
quadrupole: 1.2148 1.1460 -4.0569
quadrupole: 5.8394 4.8045 -10.6439 1.2148 1.1460 -4.0569
hfenergy: -922.1222117 hartree
pointgroup: C01[X(C17H26N2O2)]
dipole: 0.1074113 -0.201073 0.5801634 debye
polarizability: 262.1347125|-1.8258501|200.266055|11.4155719|20.5606712|156.4698766 unknown
InChI: InChI=1S/C17H26N2O2/c1-12-10-13(2)16(14(3)11-12)21-17(20)15(4)19-8-6-18(5)7-9-19/h10-11,15H,6-9H2,1-5H3
charge 0 multiplicity 1
47 atoms
O  -0.840519 0.841878 0.619259
O  0.008758 1.390234 -1.496574
N  2.336173 0.619581 0.454313
N  4.674769 -1.055332 0.281947
C  3.05248 0.451999 -0.834022
C  3.260843 0.495705 1.605545
C  3.739619 -0.923275 -0.861006
C  3.957654 -0.87608 1.565819
C  1.386205 1.766024 0.538042
C  1.923059 3.134744 0.050381
C  5.448028 -2.31044 0.23908
C  0.142245 1.345212 -0.256041
C  -2.028542 0.226124 0.080223
C  -1.943134 -1.05345 -0.51426
C  -3.250799 0.914759 0.2699
C  -4.407675 -1.008117 -0.772315
C  -3.158364 -1.652598 -0.931978
C  -4.433139 0.273668 -0.165137
C  -0.612193 -1.753168 -0.70562
C  -3.277215 2.290249 0.90717
C  -5.694326 -1.666924 -1.241263
H  3.832949 1.236449 -0.979494
H  2.328167 0.524691 -1.663766
H  2.680725 0.583445 2.542993
H  4.04536 1.291949 1.600455
H  2.951554 -1.720351 -0.841012
H  4.312911 -1.030205 -1.801108
H  4.689047 -0.941944 2.393616
H  3.184164 -1.672441 1.719822
H  1.081151 1.840788 1.596572
H  1.194317 3.93659 0.268691
H  2.868846 3.381875 0.564951
H  2.099484 3.127311 -1.038247
H  6.013309 -2.366659 -0.708606
H  4.81023 -3.227954 0.316081
H  6.174276 -2.328809 1.071763
H  -3.120609 -2.64786 -1.392256
H  -5.393265 0.787145 -0.028366
H  -0.116435 -1.390927 -1.626637
H  0.081511 -1.552169 0.129807
H  -0.750701 -2.843694 -0.800158
H  -4.314372 2.634216 1.058075
H  -2.761208 2.291216 1.88406
H  -2.760707 3.034096 0.271185
H  -6.451599 -1.694769 -0.435847
H  -6.141701 -1.113144 -2.088796
H  -5.518732 -2.703537 -1.576442
