program: Gaussian 09
title: 000017015
version: EM64L-G09RevD.01
frameworkgroup: C1[X(C11H13NO2)]
method: RPBEPBE
basis: SDD
operation: Freq
keyword: #p
keyword: freq=noraman
keyword: PBEPBE/SDD
title: #p freq=noraman PBEPBE/SDD
converged: NO YES NO NO
title: Mulliken charges:
elementType: O O N C C C C C C C C C C C H H H H H H H H H H H H H
charge: -0.259220 -0.250953 -0.452224 0.474382 0.450986 -0.623127 -0.446024 -0.348321 -0.369745 -0.383858 0.177100 -0.810308 0.282231 -0.766419 0.270761 0.264178 0.358164 0.231209 0.303152 0.229441 0.228690 0.225280 0.222440 0.234442 0.251092 0.261695 0.244954
chargesum: 0.00000
title: Mulliken charges with hydrogens summed into heavy atoms:
elementType: O O N C C C C C C C C C C C
charge: -0.259220 -0.250953 -0.094060 0.474382 0.450986 -0.088188 -0.214815 -0.045169 -0.140304 -0.155168 0.177100 -0.128145 0.282231 -0.008677
polarizability: 2.11335499e+02 -9.42452803e+00 1.33933672e+02 1.64675834e+00 3.95071666e+00 7.03192952e+01
1716.lowfreq: -22.3464 -6.7915 -2.3414 0.0002 0.0003 0.0006 6.3789 28.6898 53.5026
frequency: -22.0541 28.5708 53.4793 66.7630 84.8611 98.7106 143.6369 174.6570 199.1130 273.5147 297.1849 343.6612 356.4558 390.1713 410.5264 447.1522 479.2544 512.8878 558.7090 580.9420 636.3821 661.6618 719.9342 772.9856 810.9137 821.6956 836.3691 853.4127 880.0446 895.8373 928.4901 950.3500 979.4829 986.5117 989.0266 1010.4256 1022.2775 1046.1119 1127.1658 1159.0055 1178.1737 1190.8215 1210.2905 1223.5250 1273.3875 1306.3180 1315.9565 1371.9134 1374.6122 1396.5496 1413.3255 1418.5311 1440.6524 1451.7234 1471.3352 1473.0659 1510.3618 1544.5102 1594.1973 1606.1672 1628.3613 1641.8956 2972.6151 2973.3834 2982.1698 3053.1288 3064.4803 3082.1320 3085.9987 3113.3549 3124.2344 3127.3213 3138.2833 3191.8597 3301.9287
redmass: 1.0185 3.2141 3.8140 3.5494 5.5408 3.3998 1.2075 4.2935 5.2132 4.1289 4.2927 3.4657 3.9933 3.6181 2.9465 3.1899 3.6226 2.6359 3.8133 3.8095 6.9012 4.6785 2.9950 4.3465 1.6783 1.8057 3.5278 1.3096 1.5690 1.8396 4.4741 1.3516 1.8423 1.3545 1.4268 2.8392 1.8098 1.5509 1.2875 1.5266 1.9728 1.1585 2.9690 2.6340 2.4934 1.6740 1.4984 4.9568 1.2686 1.2232 3.3300 1.1120 1.0747 1.0542 1.1016 1.0532 2.7005 2.4032 4.8117 7.0884 6.2662 3.3205 1.0387 1.0669 1.0388 1.0949 1.0953 1.0997 1.0913 1.0874 1.0909 1.1003 1.0968 1.0943 1.0806
irintensity: 0.5507 1.6434 2.2977 8.0122 4.9242 4.5331 0.9371 6.7550 7.6019 1.3362 5.3895 1.9767 0.3151 1.5697 0.0341 2.8310 25.0235 25.6655 7.6121 9.9550 1.1317 2.5268 1.7348 2.3238 5.4272 12.0495 22.3290 30.4468 58.2916 19.5417 4.8399 11.1007 14.5123 2.3481 4.5750 1.0736 20.8341 19.9727 23.8599 26.6595 9.1217 6.3611 105.6988 0.6733 37.1266 85.1474 18.6453 48.4250 67.2107 6.2935 22.7706 39.2263 21.9778 19.6766 25.1629 12.5536 67.3098 457.1849 136.9649 96.4557 3.4111 181.0863 47.2077 1.4339 1.2415 24.7502 8.0601 18.8176 7.6061 15.3428 26.4438 10.4548 15.3165 2.9620 280.3214
temp: 298.150 k
press: 1.00000 atm
elementType: 8 8 7 6 6 6 6 6 6 6 6 6 6 6 1 1 1 1 1 1 1 1 1 1 1 1 1
symmnumber: 1
zpe: 567238.7 jmol-1
zpe.correction: 0.216050 hartree
zpe.thermalcorrener: 0.229395 hartree
zpe.thermalcorrenthalpy: 0.230339 hartree
zpe.thermalcorrgfe: 0.174657 hartree
zpe.sumelectzpe: -631.164470 hartree
zpe.sumelectthermal: -631.151124 hartree
zpe.sumelectthermalent: -631.150180 hartree
zpe.sumelectthermalfe: -631.205862 hartree
dipole: -2.4314 -1.4344 -0.2759
dipole: 2.8364
quadrupole: -54.0787 -90.8353 -84.0892
quadrupole: -2.1256 0.1192 -0.0602
quadrupole: 22.2557 -14.5009 -7.7548 -2.1256 0.1192 -0.0602
hfenergy: -631.3805195 hartree
pointgroup: C01 [X(C11H13N1O2)]
dipole: 0.9173028 -0.6352089 0.0183852 debye
polarizability: 210.6439441|2.249769|130.5081678|15.1510654|13.1672284|74.4363538 unknown
InChI: InChI=1S/C11H13NO2/c1-8-3-5-10(6-4-8)12-11(14)7-9(2)13/h3-6,12H,7H2,1-2H3
charge 0 multiplicity 1
27 atoms
O  1.26408 2.042146 0.814253
O  2.769252 -1.895277 -0.023774
N  0.64458 -0.198923 0.414053
C  -0.758102 -0.092628 0.185956
C  -3.580447 -0.046931 -0.288337
C  3.000746 0.340605 0.945946
C  -1.457694 -1.287681 -0.130192
C  -1.473287 1.131641 0.260772
C  -2.846425 -1.25903 -0.363692
C  -2.864264 1.136665 0.023037
C  1.542418 0.810046 0.699318
C  -5.083143 -0.023835 -0.510203
C  3.514983 -0.896891 0.208799
C  4.968345 -0.882134 -0.221819
H  3.085509 0.12537 2.033261
H  3.651049 1.209641 0.754315
H  1.072517 -1.135852 0.303529
H  -0.910538 -2.236418 -0.198266
H  -0.937394 2.053522 0.493804
H  -3.367519 -2.192034 -0.610209
H  -3.404794 2.089636 0.080117
H  -5.413604 0.937216 -0.942636
H  -5.405276 -0.83185 -1.190804
H  -5.631044 -0.159387 0.44297
H  5.103604 -0.146831 -1.039061
H  5.275534 -1.876883 -0.578496
H  5.622815 -0.557802 0.608359
