program: Gaussian 09
title: 000200456
version: EM64L-G09RevD.01
frameworkgroup: C1[X(C8H5N3O3)]
method: RPBEPBE
basis: SDD
operation: Freq
keyword: #pfreq=noraman
keyword: PBEPBE/SDD
title: #p freq=noraman PBEPBE/SDD
converged: NO NO NO NO
title: Mulliken charges:
elementType: O O O N N N C C C C C C C C H H H H H
charge: -0.215950 -0.208047 -0.147262 -0.143988 0.053647 0.058526 0.413019 0.242337 -0.388621 -0.365009 -0.354123 0.120567 -0.224302 -0.194491 0.303664 0.255048 0.299880 0.246596 0.248509
chargesum: 0.00000
title: Mulliken charges with hydrogens summed into heavy atoms:
elementType: O O O N N N C C C C C C C C
charge: -0.215950 -0.208047 -0.147262 -0.143988 0.053647 0.058526 0.413019 0.242337 -0.084958 -0.109961 -0.054243 0.120567 0.022294 0.054017
polarizability: 1.97691101e+02 -5.50973257e+00 1.47072366e+02 1.68855986e-03 -5.08524273e-03 4.43319590e+01
1716.lowfreq: -4.0887 -0.0003 0.0004 0.0007 13.2585 14.9850 30.8904 79.5340 151.0742
frequency: 30.8364 79.5152 151.0740 172.4912 194.2448 272.2661 302.6137 330.6388 418.4434 430.4504 481.1957 488.0631 532.2266 562.0665 587.6079 625.6203 645.5373 711.7400 720.7557 748.3286 749.0864 779.5519 858.9779 875.2367 908.4141 932.8175 983.4699 1007.8928 1009.7094 1026.3519 1087.8141 1126.2076 1159.4782 1183.7163 1195.0391 1243.8944 1263.8559 1343.4965 1379.8108 1406.3641 1418.1545 1431.6484 1493.1560 1533.2865 1582.5748 1617.0395 3144.9472 3157.2896 3173.0306 3191.0708 3201.2629
redmass: 14.5067 5.5160 6.6847 9.1915 7.1776 4.5027 10.3241 7.4978 11.4796 3.4835 5.2451 8.5307 10.2564 4.2705 6.9540 7.0366 5.0819 6.0238 10.0813 3.9368 8.6986 1.4033 5.5789 1.3378 1.5251 8.7046 1.3704 1.3389 4.7487 2.0845 2.9193 3.0711 1.4973 1.5172 4.2819 2.3124 1.7562 8.0131 3.5453 5.3322 3.5766 4.1870 3.8346 6.6810 7.1198 6.8159 1.0871 1.0917 1.0974 1.0970 1.0938
irintensity: 0.5309 0.1294 2.1726 0.5152 0.0115 3.3863 1.5079 2.1749 0.1152 2.8894 6.6480 1.1586 1.8153 4.1065 3.7299 1.9988 16.3695 1.1149 25.8865 5.3410 24.9613 63.6154 5.5463 16.8421 23.8401 5.4521 5.8284 0.4849 20.1101 1.1503 5.3698 53.9710 16.4561 64.7730 134.0250 18.1989 16.4932 154.8070 70.7615 104.1371 7.5828 4.4337 36.8391 4.0721 12.4018 0.3195 0.9157 8.9889 10.5130 7.4833 7.2876
temp: 298.150 k
press: 1.00000 atm
elementType: 8 8 8 7 7 7 6 6 6 6 6 6 6 6 1 1 1 1 1
symmnumber: 1
zpe: 328676.2 jmol-1
zpe.correction: 0.125186 hartree
zpe.thermalcorrener: 0.135656 hartree
zpe.thermalcorrenthalpy: 0.136600 hartree
zpe.thermalcorrgfe: 0.087868 hartree
zpe.sumelectzpe: -696.638993 hartree
zpe.sumelectthermal: -696.628523 hartree
zpe.sumelectthermalent: -696.627579 hartree
zpe.sumelectthermalfe: -696.676310 hartree
dipole: 7.4757 -4.3042 -0.0007
dipole: 8.6262
quadrupole: -81.9968 -84.5880 -79.5530
quadrupole: -2.4404 0.0039 -0.0010
quadrupole: 0.0491 -2.5421 2.4929 -2.4404 0.0039 -0.0010
hfenergy: -696.7641787 hartree
pointgroup: C01 [X(C8H5N3O3)]
dipole: -2.9533113 -1.6720882 0.0002655 debye
dipolederiv: -0.2875231 0.220273 0.0000459 0.1721612 -1.0356057 -0.0001595 -0.0000837 0.0003418 -0.2583955 -0.740658 0.1621998 0.0000215 0.2527703 -0.6859029 0.0001373 0.0002391 -0.0001847 -0.2220645 -0.7886691 -0.2183646 -0.0000146 -0.1348638 -0.5269119 -0.0001027 0.0002676 0.000163 -0.1791721 0.1303653 -0.2311986 0.0000775 -0.2103699 1.2643449 0.000078 0.0000334 -0.0004999 0.1411876 -0.1349775 0.4339032 -0.0001121 -0.1544182 -0.3971915 0.0000396 0.0000295 0.000099 -0.1492961 1.8738693 0.0585493 -0.0000967 -0.1211419 1.0583388 -0.0000302 -0.0004103 -0.0000149 0.1680994 0.131763 0.0018562 -0.0000048 0.2058469 0.0488968 0.0000271 0.0000208 -0.0000203 0.0722962 0.221394 -0.2548931 -0.0000051 -0.1066293 -0.3472631 0.0000016 0.0000086 0.0000359 0.0726896 -0.0644378 0.0710738 0.0000269 0.0218865 -0.119193 -0.0000009 -0.0001408 0.0000309 -0.1019901 -0.2150743 -0.0384753 -0.000001 -0.0268341 0.1568194 0.0000264 0.0000339 0.0000303 -0.1497416 -0.2879379 0.1035518 0.0000117 -0.1650242 0.0085741 0.0000189 -0.0000382 0.0000385 -0.1090783 -0.3842566 -0.2093348 0.0000528 0.1006709 0.3242797 0.0000151 0.0000309 0.0000458 0.1237252 0.1252927 0.0981581 0.0000301 0.1036054 0.1556948 0.0000352 0.0000219 0.0000469 -0.1119877 0.1674228 -0.1665841 0.0000159 0.0408016 -0.0936312 -0.0000072 0.0000261 -0.0000409 -0.1324762 0.1381463 -0.0091674 -0.0000037 0.0212755 0.0754505 -0.0000121 -0.0000026 -0.0000201 0.179559 0.0684545 0.0730912 0. 0.0137272 -0.0343489 -0.0000204 0.0000124 -0.0000241 0.1596903 0.120198 -0.0408344 -0.0000061 0.042377 0.0525957 -0.000019 -0.0000075 -0.000006 0.1777082 -0.0046617 -0.0957171 -0.0000248 -0.0994323 0.0136023 -0.0000244 -0.0000355 -0.0000226 0.1606129 -0.0687098 0.041913 -0.0000133 0.0435912 0.0814511 -0.0000027 -0.0000057 0.0000013 0.1586337 unknown
polarizability: 197.7680888|5.1433633|146.9953778|0.0017253|0.0050729|44.331959 unknown
InChI: InChI=1S/C8H5N3O3/c12-10-7-4-2-1-3-6(7)5-8(9-10)11(13)14/h1-5H
charge 0 multiplicity 1
19 atoms
O  -0.456828 2.788864 0.000066
O  3.329619 -1.656404 -0.000212
O  3.815283 0.575057 -0.000298
N  -0.114197 1.535291 0.000488
N  1.214252 1.215268 0.000327
N  2.997253 -0.406258 0.000233
C  -0.765641 -0.859517 0.000066
C  -1.146645 0.523639 0.000215
C  0.627482 -1.188601 0.000105
C  -1.807808 -1.839873 -0.000138
C  -2.502114 0.929945 0.000108
C  1.512453 -0.118123 0.000227
C  -3.149266 -1.442915 -0.000219
C  -3.497829 -0.057845 -0.0001
H  0.993204 -2.216364 0.000004
H  -1.537142 -2.900957 -0.00025
H  -2.733993 1.99764 0.000227
H  -3.941697 -2.198071 -0.000386
H  -4.552285 0.235824 -0.000162
