program: Gaussian 09
title: 000200458
version: EM64L-G09RevD.01
frameworkgroup: C1[X(C9H19NO3Si)]
method: RPBEPBE
basis: SDD
operation: Freq
keyword: #p
keyword: freq=noraman
keyword: PBEPBE/SDD
title: #p freq=noraman PBEPBE/SDD
converged: NO YES NO NO
title: Mulliken charges:
elementType: Si O O O N C C C C C C C C C H H H H H H H H H H H H H H H H H H H
charge: 1.522647 -0.542248 -0.542265 -0.538150 -0.245535 -0.506898 -0.367573 -0.366929 -0.367277 -0.270052 -0.271351 -0.271939 -0.692030 -0.691250 0.243093 0.217529 0.231608 0.217378 0.231870 0.217123 0.231822 0.220422 0.190155 0.220338 0.190191 0.220495 0.190141 0.204010 0.221307 0.238956 0.204013 0.228305 0.232096
chargesum: 0.00000
title: Mulliken charges with hydrogens summed into heavy atoms:
elementType: Si O O O N C C C C C C C C C
charge: 1.522647 -0.542248 -0.542265 -0.538150 -0.245535 -0.263805 0.081564 0.082319 0.081668 0.140525 0.139179 0.138696 -0.027758 -0.026835
polarizability: 1.43331554e+02 2.31243829e-02 1.25509439e+02 4.48625647e-01 -3.72641643e-02 1.19896038e+02
1716.lowfreq: -12.9224 -7.2597 -0.0016 -0.0012 -0.0011 15.5844 50.8908 82.4665 97.0513
frequency: 50.8468 82.2252 96.9958 107.1090 162.5369 167.0027 185.3288 228.6520 234.7541 241.0512 255.8878 276.5888 294.3576 300.2285 325.8517 344.5208 405.9437 416.8788 418.4399 456.1168 508.2984 548.5388 579.0015 581.6658 663.3890 685.9392 688.7513 733.3934 862.6283 863.5515 879.4529 895.8802 919.6802 921.3678 923.0800 970.9188 999.0217 1041.1251 1046.8507 1049.8517 1065.5031 1069.5607 1071.6161 1090.2470 1100.1798 1154.3118 1155.5672 1173.3085 1201.5298 1217.7749 1218.3347 1248.0510 1262.5304 1267.6707 1268.5813 1288.4448 1340.7228 1345.0375 1345.2380 1357.5018 1359.6481 1361.8850 1372.4287 1388.8931 1457.7749 1458.7268 1458.9204 1468.5548 1478.5148 1480.8914 1483.2540 1483.7442 1485.8556 1493.9982 2948.5048 2949.5234 2950.2633 2958.8635 2959.4925 2964.4782 2965.1819 2967.2512 2986.9949 3043.5124 3043.7099 3043.9106 3054.2577 3057.2635 3058.7101 3063.9058 3064.8552 3078.9974 3083.7839
redmass: 2.6254 4.4308 3.6794 3.7408 2.7402 2.8468 4.6170 1.0727 3.3644 2.9183 1.2185 1.9101 3.2716 2.9052 3.3079 3.8462 2.7009 3.1849 3.2163 3.4843 6.5212 2.8415 2.6998 2.7442 4.6802 9.2360 5.6452 2.8857 1.9385 1.9489 2.2869 2.4746 2.1896 2.1196 1.1580 1.3589 2.6547 1.3638 2.5128 2.2326 2.1717 4.5133 4.7523 3.7868 2.8829 1.7002 1.6969 1.8673 1.0892 1.2510 1.2449 1.1738 1.4798 1.5490 1.5437 1.3245 1.2788 1.2651 1.2617 1.2950 1.3367 1.3351 1.1846 1.1952 1.0915 1.0892 1.0880 1.0432 1.0508 1.0423 1.0783 1.0799 1.0805 1.0496 1.0662 1.0657 1.0656 1.0672 1.0673 1.0362 1.0598 1.0442 1.0820 1.0949 1.0953 1.0947 1.0986 1.0972 1.0974 1.0985 1.0984 1.1002 1.0992
irintensity: 0.3184 10.5669 3.0260 3.9805 1.8993 6.2664 35.6601 1.0533 10.3612 11.2202 0.9506 4.1708 0.0245 9.7422 3.2930 3.3405 1.4256 0.1561 0.2345 4.3458 0.0720 46.6240 6.2752 5.8285 139.3907 122.4852 124.8109 16.4934 11.1883 12.0789 75.4322 23.6110 16.8593 13.3161 11.2854 0.0233 25.0236 40.3813 22.4214 10.7788 42.6355 87.2839 83.9448 153.7264 1.4072 3.9946 3.6622 3.5024 2.3216 1.3021 1.5684 11.3185 3.6037 14.6105 11.3166 0.0772 4.9969 0.8453 0.8666 2.4398 2.7376 2.4682 16.3019 15.6230 8.7320 7.4802 5.5644 4.1701 6.1552 15.7599 7.5000 5.0461 5.1560 17.1076 37.8886 26.0218 17.1457 82.9808 79.9183 36.3975 250.5151 10.9047 8.9590 48.5700 49.4465 24.5949 4.8649 0.7666 77.4292 47.1022 46.6242 19.9686 38.5747
temp: 298.150 k
press: 1.00000 atm
elementType: 14 8 8 8 7 6 6 6 6 6 6 6 6 6 1 1 1 1 1 1 1 1 1 1 1 1 1 1 1 1 1 1 1
symmnumber: 1
zpe: 736492.7 jmol-1
zpe.correction: 0.280515 hartree
zpe.thermalcorrener: 0.295639 hartree
zpe.thermalcorrenthalpy: 0.296583 hartree
zpe.thermalcorrgfe: 0.239637 hartree
zpe.sumelectzpe: -923.088057 hartree
zpe.sumelectthermal: -923.072933 hartree
zpe.sumelectthermalent: -923.071989 hartree
zpe.sumelectthermalfe: -923.128935 hartree
dipole: -6.2692 -0.0064 0.8345
dipole: 6.3245
quadrupole: -86.2771 -91.8306 -91.3512
quadrupole: -0.0132 -0.5879 0.0179
quadrupole: 3.5425 -2.0110 -1.5315 -0.0132 -0.5879 0.0179
hfenergy: -923.3685722 hartree
pointgroup: C01 [X(C9H19N1O3Si1)]
dipole: 2.4749901 -0.0501999 -0.2516657 debye
polarizability: 143.2833268|0.4812332|125.0846179|1.0435224|-1.481315|120.3690856 unknown
InChI: InChI=1S/C9H19NO3Si/c1-9(2)14-11-6-3-10(4-7-12-14)5-8-13-14/h9H,3-8H2,1-2H3
charge 0 multiplicity 1
33 atoms
Si -0.758252 0.057911 0.173246
O  -0.310296 -1.219027 1.30263
O  -0.608765 -0.331202 -1.53962
O  -0.32397 1.70141 0.641126
N  1.683115 0.007436 -0.097591
C  -2.651182 0.103821 0.388555
C  2.056942 -1.222879 0.646354
C  1.831114 -0.064291 -1.574171
C  2.094531 1.289551 0.53011
C  1.037495 -1.414606 1.795756
C  0.610701 -0.830498 -2.13942
C  0.950553 2.311911 0.324216
C  -3.279492 -1.299825 0.190449
C  -3.301238 1.149699 -0.553661
H  -2.822965 0.421607 1.437269
H  3.097767 -1.183079 1.032409
H  1.980511 -2.077233 -0.049471
H  2.785966 -0.541903 -1.880882
H  1.819875 0.967747 -1.966985
H  3.055161 1.671126 0.123042
H  2.225582 1.110653 1.611978
H  1.104279 -2.439266 2.203307
H  1.244583 -0.70097 2.621718
H  0.536575 -0.684467 -3.232015
H  0.709751 -1.919414 -1.942744
H  1.086163 3.180612 0.993065
H  0.942647 2.681433 -0.723532
H  -4.373949 -1.258171 0.357121
H  -3.106847 -1.660885 -0.840749
H  -2.848537 -2.037794 0.890105
H  -4.395279 1.192447 -0.384359
H  -3.129791 0.880415 -1.612301
H  -2.885846 2.159328 -0.383458
