program: Gaussian 09
title: 000200470
version: EM64L-G09RevD.01
frameworkgroup: C1[X(C19H20N2O)]
method: RPBEPBE
basis: SDD
operation: Freq
keyword: #p
keyword: freq=noraman
keyword: PBEPBE/SDD
title: #p freq=noraman PBEPBE/SDD
converged: YES YES NO NO
title: Mulliken charges:
elementType: O N N C C C C C C C C C C C C C C C C C C C H H H H H H H H H H H H H H H H H H H H
charge: -0.473929 -0.067114 -0.013225 -0.464080 -0.446416 -0.430287 -0.430375 -0.414130 -0.016465 -0.075641 0.375535 0.020096 0.108671 -0.361967 -0.401880 -0.307688 -0.233104 -0.222874 -0.242076 -0.182522 -0.374457 -0.177213 0.221602 0.229507 0.230785 0.220272 0.224202 0.223796 0.247500 0.223638 0.223957 0.244701 0.249586 0.264421 0.291428 0.357420 0.223357 0.223376 0.225882 0.236815 0.239349 0.229548
chargesum: 0.00000
title: Mulliken charges with hydrogens summed into heavy atoms:
elementType: O N N C C C C C C C C C C C C C C C C C C C
charge: -0.116509 -0.067114 -0.013225 -0.012971 0.004641 0.017712 0.040763 0.054528 -0.016465 -0.075641 0.375535 0.020096 0.108671 -0.112382 -0.137460 -0.016260 -0.009747 0.000502 -0.016194 0.054292 -0.135108 0.052336
polarizability: 2.41150250e+02 -3.59797070e+00 2.16860348e+02 1.18973585e+01 1.30927127e+01 1.83626894e+02
1716.lowfreq: -10.0257 -6.8665 -1.6811 -0.0006 -0.0004 0.0000 4.1288 15.5940 25.1206
frequency: -9.1908 15.2325 25.0933 31.8496 39.0954 56.2153 61.7958 78.5080 104.8906 143.6822 170.0851 219.2105 234.2642 253.1817 275.7148 284.5123 301.6296 343.4120 345.6624 385.9243 402.1118 404.1088 404.8903 432.1587 470.3661 513.1365 536.0441 590.2803 610.7765 614.7780 636.5445 637.8305 648.2415 694.9690 704.1151 753.7708 756.1548 761.8760 788.0989 828.8003 831.4058 854.2175 873.7546 875.9089 897.0671 905.6294 915.4967 931.2311 935.7362 953.9416 964.3167 968.7426 973.3237 979.8356 990.1356 995.8768 1008.7423 1011.1815 1027.1399 1039.5565 1042.3893 1065.2275 1080.9654 1087.5817 1105.0665 1146.1598 1158.0204 1170.8601 1171.8787 1174.1352 1186.2696 1187.1996 1205.2471 1219.1970 1237.0943 1244.5103 1281.3905 1282.5382 1297.7231 1302.1451 1307.3117 1315.4917 1316.1419 1331.7417 1352.4450 1382.0178 1412.7806 1434.1008 1446.0462 1456.7165 1463.8402 1472.0325 1476.3804 1476.6179 1491.5445 1566.4177 1575.4737 1592.9855 1608.4669 2279.5262 2851.4760 2994.4794 3001.0651 3003.1623 3007.5180 3019.4401 3055.0027 3069.8833 3080.5200 3092.6345 3122.4178 3126.6675 3133.6168 3141.0139 3149.2389 3159.4318 3166.0720 3168.0572 3193.5398 3567.6638
redmass: 3.5288 4.0010 4.3635 4.2859 4.3530 4.8980 4.0153 1.8245 3.9946 3.6192 3.8065 4.5632 5.0371 3.8267 3.1039 2.1919 1.7195 3.1443 4.9571 3.7154 3.3970 3.0474 3.0815 6.7168 3.7814 5.4114 3.8648 6.0824 7.2830 6.3927 2.6899 2.6111 5.3577 5.2912 1.8248 2.0277 2.1388 1.6836 2.2926 2.2122 1.6358 1.2566 3.3387 3.2950 3.0666 2.5395 1.5163 1.6572 1.7128 5.2609 1.4886 4.4515 2.0859 1.4186 5.5826 1.3376 1.4067 2.6802 2.2280 2.3228 2.1169 2.2322 1.6110 1.6483 2.5584 3.3589 1.2124 1.0647 1.2585 1.7733 1.1438 1.1828 3.6568 1.1567 1.2280 1.3666 1.3167 1.7414 1.2438 2.1678 1.4572 1.3422 1.3166 2.9826 1.4236 9.2611 1.9881 2.2229 2.1602 1.0810 1.0834 1.0800 1.2170 1.8043 1.0928 6.1153 5.8436 6.3767 6.0627 11.8840 1.0698 1.0627 1.0653 1.0612 1.0846 1.0646 1.1011 1.1020 1.1025 1.1046 1.0846 1.0881 1.0889 1.0906 1.0932 1.0953 1.0989 1.0997 1.0955 1.0660
irintensity: 0.3289 0.1528 0.9015 3.3165 0.3757 0.4694 0.9044 0.2555 0.0714 2.7227 0.8512 1.7372 0.0285 4.4739 6.9817 65.2125 87.3340 18.4908 33.7486 2.0159 2.6817 5.6501 17.2177 2.0290 2.3305 2.6259 8.2160 16.3925 2.7311 0.0623 3.2096 18.1331 22.9491 2.1772 66.6981 32.0130 14.6737 42.2850 45.8324 10.3089 0.8600 0.4624 11.1181 26.2996 22.2751 3.1387 3.6409 6.3351 12.0234 44.3208 0.5017 8.5892 10.1391 3.0473 0.3700 0.0519 0.9293 20.7011 9.2011 9.7276 18.4585 12.4691 3.7500 5.4869 2.0867 11.7011 1.8023 0.8396 4.6569 22.5880 12.4191 1.0737 43.6744 3.8004 14.4611 2.4597 6.1430 1.8636 1.5922 26.9962 7.0147 1.9167 17.4030 24.3411 39.1477 0.4684 21.1967 18.9295 48.3289 5.5877 4.3599 9.0910 14.2172 11.0433 11.3725 5.9646 47.4569 1.0240 3.5837 7.7604 53.8782 42.4350 36.6346 48.5371 12.1123 44.8658 17.2893 6.6987 28.6680 81.1736 0.1727 10.0111 13.1800 17.6879 27.1711 22.8577 31.9363 13.5914 3.7285 14.0867
temp: 298.150 k
press: 1.00000 atm
elementType: 8 7 7 6 6 6 6 6 6 6 6 6 6 6 6 6 6 6 6 6 6 6 1 1 1 1 1 1 1 1 1 1 1 1 1 1 1 1 1 1 1 1
symmnumber: 1
zpe: 897192.2 jmol-1
zpe.correction: 0.341722 hartree
zpe.thermalcorrener: 0.361198 hartree
zpe.thermalcorrenthalpy: 0.362142 hartree
zpe.thermalcorrgfe: 0.290591 hartree
zpe.sumelectzpe: -919.064781 hartree
zpe.sumelectthermal: -919.045305 hartree
zpe.sumelectthermalent: -919.044361 hartree
zpe.sumelectthermalfe: -919.115912 hartree
dipole: -1.0479 0.8844 -0.7384
dipole: 1.5574
quadrupole: -115.2136 -115.3657 -125.6495
quadrupole: 2.0405 5.4527 2.4167
quadrupole: 3.5293 3.3773 -6.9066 2.0405 5.4527 2.4167
hfenergy: -919.406503 hartree
pointgroup: C01 [X(C19H20N2O1)]
dipole: -0.4128321 -0.3333929 0.3063523 debye
polarizability: 242.3700936|2.9149745|220.3082857|-8.038585|7.1033187|178.9591129 unknown
InChI: InChI=1S/C19H20N2O/c22-19(17-9-2-1-3-10-17,18-11-4-5-13-20-18)12-8-16-21-14-6-7-15-21/h1-5,9-11,13,22H,6-7,14-16H2
charge 0 multiplicity 1
42 atoms
O  1.242388 -0.182827 -1.958504
N  -3.866804 0.628915 -0.953271
N  1.159838 -1.115762 1.591512
C  -5.853686 0.125772 0.401833
C  -4.974984 -1.167548 0.316465
C  -5.28394 1.049281 -0.731064
C  -3.931286 -0.857953 -0.815991
C  -2.943073 1.272312 0.035565
C  1.045089 0.144103 -0.522285
C  -1.537321 0.881633 -0.161715
C  2.048481 1.241155 -0.085257
C  -0.358021 0.551205 -0.300967
C  1.351804 -1.168281 0.241727
C  1.749511 2.1339 0.970439
C  3.310277 1.312468 -0.724654
C  1.814933 -2.323907 -0.427552
C  2.700397 3.096534 1.376556
C  4.259452 2.276315 -0.317988
C  3.957457 3.172564 0.73351
C  2.096771 -3.476503 0.340907
C  1.432773 -2.234924 2.317625
C  1.904771 -3.436893 1.740368
H  -6.926533 -0.084982 0.249149
H  -5.750292 0.607633 1.39079
H  -4.471818 -1.37027 1.278336
H  -5.577818 -2.058312 0.067241
H  -5.841216 0.876817 -1.671227
H  -5.343272 2.126145 -0.496111
H  -2.92804 -1.268487 -0.616751
H  -4.283276 -1.274181 -1.778294
H  -3.216116 1.049817 1.098643
H  -3.036756 2.367611 -0.094071
H  0.780103 2.065982 1.473549
H  3.535199 0.615346 -1.538362
H  1.935143 -2.303833 -1.512096
H  0.906592 0.585428 -2.487096
H  2.460863 3.785211 2.194727
H  5.232249 2.328271 -0.820287
H  4.693863 3.92065 1.048598
H  2.456889 -4.389149 -0.146232
H  1.266633 -2.156207 3.39838
H  2.111974 -4.307849 2.370258
