program: Gaussian 09
title: 000200473
version: EM64L-G09RevD.01
frameworkgroup: C1[X(C21H25N2O)]
method: RPBEPBE
basis: SDD
operation: Freq
keyword: #p
keyword: freq=noraman
keyword: PBEPBE/SDD
title: #p freq=noraman PBEPBE/SDD
converged: YES YES NO NO
title: Mulliken charges:
elementType: O N N C C C C C C C C C C C C C C C C C C C C C H H H H H H H H H H H H H H H H H H H H H H H H H
charge: -0.458694 -0.082126 -0.157521 -0.346805 -0.360653 -0.441927 -0.443432 -0.398647 -0.408651 -0.581034 -0.164457 0.191005 -0.085961 0.437332 0.154571 -0.417824 -0.385077 -0.275838 -0.233908 -0.222689 -0.176196 -0.232660 -0.346697 -0.165000 0.255029 0.262471 0.319171 0.251266 0.256865 0.238457 0.236908 0.259001 0.258497 0.212413 0.293828 0.288357 0.265265 0.300401 0.255602 0.383627 0.238378 0.268243 0.261961 0.236979 0.240677 0.258291 0.243906 0.265017 0.252275
chargesum: 1.00000
title: Mulliken charges with hydrogens summed into heavy atoms:
elementType: O N N C C C C C C C C C C C C C C C C C C C C C
charge: -0.075067 -0.082126 -0.157521 0.170695 0.209785 0.053395 0.052477 0.072262 0.173534 0.240234 -0.164457 0.191005 -0.085961 0.437332 0.154571 -0.179447 -0.116834 -0.013877 0.003071 0.017989 0.082095 0.011246 -0.081679 0.087276
polarizability: 2.61209317e+02 -1.31848718e+00 2.37547334e+02 7.49510411e+00 -1.25465755e+01 2.04116720e+02
1716.lowfreq: -14.4555 -8.5675 -0.0002 0.0003 0.0005 1.4989 4.9909 14.4914 23.8810
frequency: -4.5025 14.0034 23.8203 31.2337 36.7611 51.9320 71.0678 92.9324 140.4776 176.3587 179.4002 187.5352 219.5241 225.2649 255.4572 273.3349 282.0015 314.7126 327.1080 345.3153 357.8536 370.1696 401.9889 404.3407 408.8167 417.7869 430.5832 444.3123 461.7046 480.3945 510.4267 529.7232 587.9359 604.1751 615.1535 624.0228 651.3639 678.6386 699.7978 705.5386 738.1592 765.4317 776.6671 782.2654 807.1222 811.0843 832.0972 854.6423 858.2801 869.9883 887.7952 900.7973 912.6884 929.2610 937.1621 944.4173 968.3397 972.2566 978.4174 980.2484 983.8624 989.9478 994.1338 1005.3035 1007.4903 1009.6842 1027.1700 1038.2646 1049.0474 1085.7994 1097.3354 1111.4657 1120.0552 1143.2561 1152.2065 1170.0905 1171.3310 1177.1398 1177.9137 1180.8192 1187.4028 1211.6373 1215.4112 1239.5739 1263.6422 1289.0880 1294.3953 1315.6187 1319.2601 1323.9812 1336.1463 1342.2112 1353.3081 1363.1725 1369.0225 1382.5773 1386.5467 1407.7477 1427.5144 1431.2043 1437.1537 1449.8002 1452.8957 1460.6694 1466.1686 1467.2917 1468.0049 1479.0744 1483.8698 1486.8043 1489.4710 1568.0850 1587.2342 1593.8275 1608.3854 2268.2764 2940.9693 2991.5712 2999.6503 3007.0174 3007.9359 3011.3766 3014.5540 3031.2877 3061.0639 3062.0349 3063.7885 3075.6855 3087.5201 3094.3436 3118.6316 3138.0899 3140.7469 3148.7290 3152.6067 3158.8854 3162.5142 3163.8310 3171.2971 3174.1268 3186.7940
redmass: 4.4788 5.0554 3.5175 3.7381 4.2965 4.8738 3.9153 5.0900 2.6070 1.9394 1.9994 3.6513 4.6365 4.1082 1.8666 4.6208 3.9294 2.8779 2.0630 4.8600 3.8959 4.0004 2.8557 2.9823 3.3440 2.0019 5.2457 4.3691 3.1021 3.8383 2.4498 3.1571 3.9147 3.9472 6.4464 7.3336 6.0796 3.6830 4.7044 2.1344 2.0308 1.6845 1.5305 1.5555 1.3993 3.4485 2.1150 1.8407 1.2485 2.3957 3.4104 1.3782 3.0252 1.8357 1.5878 2.1467 1.4589 6.0984 2.0643 4.4555 1.6079 5.9393 1.7599 1.3248 2.3788 1.3551 2.1601 2.3170 2.0895 1.6014 1.7073 1.8970 1.1685 1.7392 2.5914 1.9739 1.1984 1.1107 1.3246 2.2317 1.2475 1.3473 4.0792 1.3313 1.2431 1.5290 1.1613 1.3411 1.3983 1.3217 6.3836 1.3331 1.3977 1.3790 1.3800 9.0326 1.3580 1.5247 1.1538 1.7171 2.1210 1.0958 1.9313 1.0664 1.0627 1.0836 1.0853 2.2229 1.0844 1.0638 1.0677 6.2129 5.7765 6.2963 6.0638 11.8043 1.0630 1.0675 1.0580 1.0622 1.0635 1.0597 1.0606 1.0341 1.1051 1.1003 1.0972 1.1008 1.1064 1.1077 1.0880 1.0871 1.1045 1.0921 1.0879 1.0911 1.0954 1.1032 1.0960 1.1005 1.1015
irintensity: 0.8754 3.7340 0.4943 0.6676 0.1293 0.9142 1.7647 3.5802 1.5888 0.5455 0.1611 4.2933 10.1839 0.6015 1.1782 9.8522 3.5164 0.6081 0.0725 6.9202 7.2324 0.7188 0.0845 3.8635 0.5893 0.4379 0.9152 7.1800 0.1392 5.0796 1.1588 9.8095 18.9886 20.4195 0.2250 5.5936 11.9359 0.6357 2.4484 42.7374 49.0440 43.4883 43.2702 13.2384 38.8393 84.4297 15.0794 33.9000 1.0779 3.5259 5.3081 1.3294 6.6033 18.6557 11.8441 2.5654 0.4178 57.2318 12.6181 1.0366 2.6079 2.6860 4.8513 0.3213 9.8282 0.1522 6.5333 1.9743 4.9330 6.4749 4.3768 0.4338 0.3985 2.2219 7.3226 1.4635 5.0404 1.1483 4.4423 15.0528 6.7830 0.2417 62.1732 3.6383 3.8824 10.7820 2.6321 2.1001 14.0001 37.2709 3.6945 0.5833 0.6666 0.6234 10.0368 2.4224 21.9795 229.4793 19.9637 113.5263 34.2829 0.7403 25.9052 8.1534 10.5124 35.1879 21.1282 16.4943 12.2359 26.4542 35.6878 18.3027 22.1954 1.5087 2.0619 88.5577 484.3955 16.8994 17.6363 11.7783 13.8205 4.3367 16.8360 5.4211 1.8090 8.5020 13.9253 20.0613 10.8474 15.1533 9.7823 0.5107 2.9159 14.7642 3.0119 3.0453 12.3719 2.4393 7.6038 13.2555 8.7505
temp: 298.150 k
press: 1.00000 atm
elementType: 8 7 7 6 6 6 6 6 6 6 6 6 6 6 6 6 6 6 6 6 6 6 6 6 1 1 1 1 1 1 1 1 1 1 1 1 1 1 1 1 1 1 1 1 1 1 1 1 1
symmnumber: 1
zpe: 1083959.8 jmol-1
zpe.correction: 0.412858 hartree
zpe.thermalcorrener: 0.434152 hartree
zpe.thermalcorrenthalpy: 0.435096 hartree
zpe.thermalcorrgfe: 0.360598 hartree
zpe.sumelectzpe: -997.905974 hartree
zpe.sumelectthermal: -997.884680 hartree
zpe.sumelectthermalent: -997.883736 hartree
zpe.sumelectthermalfe: -997.958234 hartree
dipole: -9.6121 -1.6910 -3.6776
dipole: 10.4296
quadrupole: -45.8608 -113.1798 -125.2829
quadrupole: -8.7032 2.6966 -2.1822
quadrupole: 48.9137 -18.4053 -30.5084 -8.7032 2.6966 -2.1822
hfenergy: -998.3188321 hartree
pointgroup: C01 [X(C21H25N2O1)]
dipole: -3.6684996 -1.797496 -0.3853127 debye
polarizability: 261.436322|6.3848223|215.1757646|5.3412182|-19.6344536|226.2612844 unknown
InChI: InChI=1S/C21H25N2O/c1-23(16-8-3-9-17-23)18-10-14-21(24,19-11-4-2-5-12-19)20-13-6-7-15-22-20/h2,4-7,11-13,15,24H,3,8-9,16-18H2,1H3
charge 1 multiplicity 1
49 atoms
O  0.634426 0.723058 1.264537
N  -3.522344 -0.611874 -0.401496
N  2.461475 -0.972049 1.590246
C  -4.913258 -1.25504 -0.601877
C  -3.169633 -0.583765 1.110406
C  -6.010477 -0.574468 0.232681
C  -4.260534 0.094811 1.953806
C  -5.646295 -0.55304 1.734582
C  -2.472608 -1.503918 -1.155175
C  -3.478801 0.792993 -0.991508
C  -1.119807 -1.0082 -0.947978
C  -0.04459 -0.499194 -0.622374
C  1.109346 0.232413 -0.032946
C  1.581214 1.396087 -0.925017
C  2.286515 -0.756239 0.258214
C  1.450226 1.346694 -2.333595
C  2.213518 2.506298 -0.316674
C  3.102766 -1.350793 -0.724645
C  1.954825 2.399339 -3.130772
C  2.71438 3.557456 -1.114623
C  4.139404 -2.209425 -0.294979
C  2.590289 3.506014 -2.52324
C  3.465064 -1.794586 2.005383
C  4.326199 -2.43663 1.089661
H  -4.805389 -2.312575 -0.298977
H  -5.130867 -1.217617 -1.683688
H  -2.190932 -0.083518 1.202392
H  -3.052178 -1.642728 1.40595
H  -6.94391 -1.14334 0.068534
H  -6.206784 0.449631 -0.135985
H  -4.298531 1.18077 1.747318
H  -3.952288 -0.000079 3.010956
H  -6.416973 -0.003299 2.301491
H  -5.63831 -1.588835 2.128601
H  -2.601151 -2.528471 -0.760255
H  -2.774888 -1.498071 -2.218753
H  -4.201194 1.435916 -0.473078
H  -2.462156 1.193341 -0.866857
H  -3.731926 0.736187 -2.06196
H  1.184059 0.159589 1.92813
H  0.948896 0.49604 -2.811737
H  2.286233 2.549113 0.774187
H  2.948731 -1.134062 -1.785462
H  1.851221 2.35699 -4.220456
H  3.198834 4.417068 -0.639418
H  4.798388 -2.686474 -1.027076
H  2.981152 4.322269 -3.139952
H  3.571758 -1.930183 3.085705
H  5.124004 -3.089807 1.453772
