program: Gaussian 09
title: 000200451
version: EM64L-G09RevD.01
frameworkgroup: C1[X(C15H23N)]
method: RPBEPBE
basis: SDD
operation: Freq
keyword: #pfreq=noraman
keyword: PBEPBE/SDD
title: #p freq=noraman PBEPBE/SDD
converged: YES YES NO NO
title: Mulliken charges:
elementType: N C C C C C C C C C C C C C C C H H H H H H H H H H H H H H H H H H H H H H H
charge: -0.025743 0.272771 -0.558699 -0.560312 -0.482281 -0.459001 0.449766 -0.364783 -0.631884 -0.557884 -0.431743 -0.698744 0.435459 -0.241792 -0.415992 -0.821191 0.241496 0.222453 0.216705 0.229319 0.198688 0.210693 0.216218 0.229931 0.228163 0.204083 0.225935 0.211812 0.221468 0.244045 0.222456 0.209850 0.207302 0.217154 0.220535 0.231319 0.225363 0.222929 0.234134
chargesum: 0.00000
title: Mulliken charges with hydrogens summed into heavy atoms:
elementType: N C C C C C C C C C C C C C C C
charge: -0.025743 0.272771 -0.094750 -0.114287 -0.072900 -0.012852 0.449766 0.067463 0.027331 -0.313840 -0.209287 -0.064438 0.435459 -0.021257 -0.184673 -0.138764
polarizability: 1.90093079e+02 -4.61642004e+00 1.41506067e+02 2.37811406e+00 1.11473248e+00 1.57291114e+02
1716.lowfreq: -18.2853 -14.8921 -0.0006 -0.0006 -0.0005 4.3160 9.7225 22.5121 41.1947
frequency: -17.9078 21.2120 41.1546 61.1747 83.2309 103.4422 139.8121 165.7808 185.2148 203.5939 209.2822 225.4293 271.5847 281.7653 307.9051 309.4581 371.2524 395.1310 403.2166 442.6553 454.4388 499.9658 522.8972 586.2763 616.5057 650.6447 700.2890 712.7153 741.5770 778.2016 796.8558 812.1351 858.6570 864.1651 879.7581 896.5896 904.3478 914.9178 941.2255 961.6255 978.1424 986.1516 991.5081 998.1187 1015.9431 1027.7087 1047.6063 1053.4893 1068.4530 1098.2590 1106.5153 1113.8474 1122.8978 1125.1358 1145.3613 1188.7829 1191.7006 1208.8832 1233.8591 1239.6031 1258.9371 1277.3206 1288.6788 1299.7506 1303.3017 1309.4102 1318.5766 1333.8493 1347.1000 1370.8421 1387.1532 1396.1163 1415.7838 1426.2230 1452.2992 1461.2864 1463.5432 1469.7225 1470.2241 1472.7261 1473.3930 1474.7447 1476.3259 1484.4542 1485.4189 1486.2657 1593.1826 1611.9712 2894.2189 2950.2155 2969.8110 2973.4493 2976.2417 2981.0848 2985.0349 3002.9495 3005.2324 3025.9031 3035.4673 3054.2657 3059.6460 3068.1162 3070.6573 3073.6469 3080.2047 3082.7766 3091.8586 3113.0716 3116.1887 3132.6229 3152.6022
redmass: 1.0214 3.2503 3.1905 2.8642 2.1575 2.3546 2.8050 2.9557 2.1190 1.3565 2.3408 1.2250 2.7090 2.6033 2.7279 3.4203 2.9012 1.8803 2.1793 2.7616 3.3049 2.7539 4.8245 3.6313 2.9075 4.4384 3.8826 1.8681 1.1604 2.4253 1.7534 3.1021 2.2908 1.4475 1.9966 1.3242 2.0937 1.6155 2.2791 1.8713 1.3564 2.5449 3.2942 1.6892 1.7534 2.8249 1.5708 2.5952 2.0168 1.7798 1.8213 1.9439 1.6172 1.8919 1.5261 1.2595 1.4892 1.7068 1.6737 1.8016 1.4697 1.3200 1.3664 1.4530 1.2221 1.3265 1.3977 1.3895 1.5138 6.9766 1.2110 1.2258 2.5542 1.1534 1.0876 1.0792 1.0731 1.2645 1.1661 1.0532 1.0588 1.0930 1.0442 1.1164 1.0798 1.5548 5.7146 6.1372 1.0515 1.0593 1.0356 1.0385 1.0629 1.0654 1.0693 1.0699 1.0875 1.0780 1.1005 1.0951 1.1010 1.1011 1.0992 1.1027 1.1013 1.0996 1.0953 1.0895 1.0864 1.0912 1.0983
irintensity: 0.5016 0.0425 0.1052 0.0740 0.1144 0.2018 1.7899 0.8939 0.9136 0.6633 1.4696 0.1521 0.5571 1.4348 0.2470 0.1559 0.5614 6.3789 0.6397 4.7507 0.0747 0.3117 0.9624 0.6688 10.6258 9.6482 4.8408 31.3706 18.3681 10.4170 27.2630 2.5556 9.6183 1.7984 7.9277 1.3185 7.5894 0.6074 5.8041 9.9372 0.3855 2.1305 1.3151 3.0537 11.7942 7.4705 11.4430 11.7335 11.1698 0.3708 10.8067 0.4430 7.7382 8.2034 0.2465 2.2918 3.2828 1.5319 0.4656 3.8214 0.2478 0.9741 0.8263 3.6478 0.0465 1.9120 3.2285 4.9118 3.3226 0.6776 11.3548 12.0771 1.4552 4.3939 9.4797 3.0746 10.3532 24.3160 4.9258 10.7979 3.8200 5.8869 11.2144 9.7581 8.8575 25.0737 8.6786 32.5524 85.3964 24.4299 54.5434 37.3411 19.1880 50.7918 50.7791 11.5398 33.7127 61.1916 15.9047 22.2262 23.0951 79.9423 45.8359 24.7961 46.3304 18.4158 29.3790 15.5634 7.0927 28.1910 25.3489
temp: 298.150 k
press: 1.00000 atm
elementType: 7 6 6 6 6 6 6 6 6 6 6 6 6 6 6 6 1 1 1 1 1 1 1 1 1 1 1 1 1 1 1 1 1 1 1 1 1 1 1
symmnumber: 1
zpe: 901756.5 jmol-1
zpe.correction: 0.343461 hartree
zpe.thermalcorrener: 0.359656 hartree
zpe.thermalcorrenthalpy: 0.360600 hartree
zpe.thermalcorrgfe: 0.299221 hartree
zpe.sumelectzpe: -638.890840 hartree
zpe.sumelectthermal: -638.874645 hartree
zpe.sumelectthermalent: -638.873701 hartree
zpe.sumelectthermalfe: -638.935079 hartree
dipole: 1.2126 0.0743 -0.8837
dipole: 1.5023
quadrupole: -100.8163 -100.4395 -93.4510
quadrupole: -3.1207 1.6386 1.3534
quadrupole: -2.5807 -2.2039 4.7846 -3.1207 1.6386 1.3534
hfenergy: -639.2343006 hartree
pointgroup: C01 [X(C15H23N1)]
dipole: 0.4866956 0.0162854 0.3349498 debye
polarizability: 187.1296787|12.4641257|144.3341215|-2.3155479|-0.96981|157.4264595 unknown
InChI: InChI=1S/C15H23N/c1-4-8-15(9-10-16(3)12-15)14-7-5-6-13(2)11-14/h5-7,11H,4,8-10,12H2,1-3H3
charge 0 multiplicity 1
39 atoms
N  -3.043872 1.092866 -0.167285
C  -1.027589 -0.322587 0.265169
C  -1.512279 0.396048 1.586118
C  -2.221064 -0.007273 -0.73961
C  -0.943544 -1.869701 0.515588
C  -2.987421 0.810252 1.295086
C  0.36064 0.179658 -0.187137
C  -0.609759 -2.729697 -0.724434
C  -2.552485 2.448972 -0.521463
C  1.378209 0.374754 0.786641
C  0.711689 0.380073 -1.54796
C  -0.587666 -4.238435 -0.395467
C  2.692545 0.780009 0.447688
C  2.017493 0.782973 -1.907993
C  3.004922 0.984722 -0.920238
C  3.73639 1.010752 1.528508
H  -0.903571 1.296245 1.781895
H  -1.432587 -0.264167 2.468814
H  -1.899404 0.255512 -1.758935
H  -2.862682 -0.907068 -0.812225
H  -1.918112 -2.201073 0.933662
H  -0.180291 -2.063112 1.297123
H  -3.674316 -0.030559 1.514578
H  -3.320966 1.685441 1.878535
H  0.372619 -2.423124 -1.130927
H  -1.35382 -2.540052 -1.52416
H  -2.620465 2.582774 -1.615549
H  -1.499831 2.657577 -0.215544
H  -3.207309 3.202739 -0.048914
H  1.14349 0.204791 1.845606
H  -0.024623 0.218742 -2.341881
H  0.169772 -4.463415 0.379325
H  -1.56902 -4.578289 -0.012857
H  -0.34537 -4.842884 -1.288898
H  2.265105 0.932625 -2.965456
H  4.016967 1.295193 -1.20744
H  3.6043 0.313975 2.375471
H  4.760375 0.881206 1.1360
H  3.667836 2.038338 1.936169
