program: Gaussian 09
title: 000200452
version: EM64L-G09RevD.01
frameworkgroup: C1[X(C14H20ClN)]
method: RPBEPBE
basis: SDD
operation: Freq
keyword: #p
keyword: freq=noraman
keyword: PBEPBE/SDD
title: #p freq=noraman PBEPBE/SDD
converged: YES YES NO NO
title: Mulliken charges:
elementType: Cl N C C C C C C C C C C C C C C H H H H H H H H H H H H H H H H H H H H
charge: -0.076827 -0.024078 0.266895 -0.553577 -0.537247 -0.470943 -0.469222 0.452251 -0.364851 -0.635338 -0.344291 -0.425275 -0.696699 -0.125434 -0.230908 -0.260898 0.239136 0.225695 0.210199 0.232748 0.202893 0.211763 0.218353 0.235272 0.226134 0.201846 0.229766 0.205979 0.224555 0.273260 0.233088 0.211774 0.208516 0.218512 0.229797 0.257155
chargesum: 0.00000
title: Mulliken charges with hydrogens summed into heavy atoms:
elementType: Cl N C C C C C C C C C C C C C C
charge: -0.076827 -0.024078 0.266895 -0.088746 -0.094300 -0.056287 -0.015597 0.452251 0.063129 0.024962 -0.071031 -0.192187 -0.057897 -0.125434 -0.001111 -0.003743
polarizability: 1.94549569e+02 -2.43715576e+00 1.35765355e+02 -2.28050812e-01 6.87888037e+00 1.55645308e+02
1716.lowfreq: -18.1870 -11.3085 -8.6181 0.0025 0.0028 0.0034 16.2654 31.7711 61.1727
frequency: 14.9077 31.2210 61.1601 85.5346 109.0895 125.1331 137.8867 184.4585 195.1584 205.2619 228.7011 259.3005 276.4635 288.7658 307.1716 350.0205 377.0900 393.9581 404.0151 441.0649 459.6315 495.6442 583.7170 608.5975 639.6262 670.8491 702.4181 737.4730 747.0569 787.8770 800.3404 843.8033 862.1117 871.4347 889.4578 902.7149 909.2942 941.6500 959.3325 974.1259 982.9785 988.6992 1012.7711 1028.3661 1053.8347 1063.7631 1077.3563 1096.0445 1102.5347 1113.7420 1123.1082 1124.5985 1152.7261 1184.3462 1196.4573 1216.8595 1238.6856 1258.3488 1277.4461 1283.7604 1295.7050 1301.9978 1306.3320 1322.1467 1333.6227 1346.7115 1364.2820 1388.1818 1411.5572 1426.9668 1451.1346 1460.4582 1463.0252 1465.1724 1471.9803 1474.0546 1475.1388 1477.7820 1484.0108 1486.7595 1566.8286 1603.0624 2884.3998 2950.8373 2971.4322 2978.5002 2981.3915 2987.7239 3004.4659 3006.2053 3026.5423 3035.9882 3063.7991 3069.6741 3072.4230 3074.1560 3080.8616 3083.7635 3135.1170 3157.0544 3162.9573 3175.9977
redmass: 4.0832 3.7215 2.8083 2.5568 2.2141 4.0509 3.4352 4.5321 2.1656 1.2801 1.2529 2.4068 3.1065 2.7036 3.7990 3.9273 2.3125 3.9544 2.2047 3.0078 3.6131 3.0401 4.0908 3.0499 5.0959 4.5965 2.1075 1.9405 1.6522 1.4859 3.6694 1.7419 2.2542 1.6447 1.5505 1.3568 2.1196 2.2225 2.0170 1.3621 4.3948 2.1071 2.0045 2.7396 2.5950 2.0181 2.2028 1.7878 1.7128 1.8855 1.8403 1.8296 1.6597 1.1601 1.5610 1.9335 1.5724 1.3972 1.3112 1.3250 1.2092 1.5119 1.2248 1.3718 1.3765 1.4989 6.6398 1.2092 2.8760 1.1513 1.1096 1.1772 1.1907 1.4593 1.1017 1.1264 1.0518 1.0446 1.0579 1.0828 6.2681 6.8357 1.0532 1.0594 1.0356 1.0619 1.0656 1.0678 1.0804 1.0765 1.0764 1.1009 1.1008 1.1011 1.0992 1.1014 1.1008 1.0994 1.0866 1.0928 1.0915 1.0977
irintensity: 0.1182 0.5759 0.1429 0.1463 0.2859 0.7122 1.6283 0.2281 0.6788 0.1281 0.1358 0.4197 0.1554 0.5451 0.5254 0.8453 12.0622 1.2447 1.2807 4.4167 0.9056 0.6415 2.5637 10.6653 4.3115 29.7491 32.3504 5.6337 23.4402 42.5981 11.1590 22.8041 7.8204 8.1123 12.9956 1.1104 6.3002 3.7105 21.2972 0.6597 5.1058 0.7671 12.9699 6.1504 10.2329 12.2194 21.0059 1.7196 6.1478 0.4048 4.7355 11.4158 2.8077 1.1148 4.8666 6.1173 1.9526 0.9451 2.1208 3.7029 0.5945 3.7770 1.4323 3.3199 6.5450 4.2804 2.5637 11.3262 13.8163 3.7916 14.0026 13.9997 15.4275 17.1625 23.5555 6.3027 2.7251 9.3153 5.9794 12.0518 53.0779 43.6033 88.5531 22.3780 50.3857 15.4513 59.0055 46.8614 3.9198 31.8216 59.5399 18.7064 24.1245 75.8309 44.5715 6.2041 49.1875 41.4820 7.9591 14.7568 2.2395 6.5134
temp: 298.150 k
press: 1.00000 atm
elementType: 17 7 6 6 6 6 6 6 6 6 6 6 6 6 6 6 1 1 1 1 1 1 1 1 1 1 1 1 1 1 1 1 1 1 1 1
symmnumber: 1
zpe: 805805.4 jmol-1
zpe.correction: 0.306915 hartree
zpe.thermalcorrener: 0.323403 hartree
zpe.thermalcorrenthalpy: 0.324347 hartree
zpe.thermalcorrgfe: 0.261396 hartree
zpe.sumelectzpe: -1059.052989 hartree
zpe.sumelectthermal: -1059.036501 hartree
zpe.sumelectthermalent: -1059.035557 hartree
zpe.sumelectthermalfe: -1059.098508 hartree
dipole: -1.0932 0.4772 0.7535
dipole: 1.4108
quadrupole: -116.8650 -104.8005 -98.1654
quadrupole: -0.7974 7.1289 1.7904
quadrupole: -10.2547 1.8098 8.4449 -0.7974 7.1289 1.7904
hfenergy: -1059.3599039 hartree
pointgroup: C01[X(C14H20Cl1N1)]
dipole: -0.3467978 -0.2504743 -0.3536889 debye
polarizability: 188.2550252|18.093598|140.1590173|2.258949|4.6680319|157.5461905 unknown
InChI: InChI=1S/C14H20ClN/c1-3-7-14(8-9-16(2)11-14)12-5-4-6-13(15)10-12/h4-6,10H,3,7-9,11H2,1-2H3
charge 0 multiplicity 1
36 atoms
Cl 3.79203 1.604104 1.637859
N  -3.183007 1.003635 -0.158279
C  -1.031196 -0.213059 0.253392
C  -1.545468 0.512833 1.554504
C  -2.235068 0.030725 -0.766799
C  -0.889944 -1.749687 0.551729
C  -3.066151 0.722374 1.300022
C  0.333777 0.324843 -0.214239
C  -0.510961 -2.647374 -0.647928
C  -2.898115 2.416435 -0.512754
C  1.304731 0.695141 0.757895
C  0.711594 0.391701 -1.582117
C  -0.472681 -4.14185 -0.259551
C  2.577211 1.130971 0.351996
C  1.996665 0.834707 -1.968061
C  2.95368 1.216685 -1.000916
H  -1.055236 1.496057 1.67092
H  -1.346929 -0.077417 2.467135
H  -1.914586 0.394487 -1.756149
H  -2.771153 -0.926454 -0.914975
H  -1.856694 -2.099684 0.971513
H  -0.130388 -1.886088 1.348817
H  -3.628254 -0.204865 1.526959
H  -3.503713 1.541079 1.895967
H  0.476979 -2.342464 -1.041964
H  -1.237313 -2.503867 -1.473046
H  -3.030357 2.549985 -1.600851
H  -1.872372 2.768849 -0.246686
H  -3.629591 3.068679 -0.003464
H  1.069929 0.640864 1.824823
H  0.004438 0.091867 -2.36165
H  0.263169 -4.323063 0.546554
H  -1.459737 -4.485211 0.104315
H  -0.191182 -4.774575 -1.121129
H  2.260897 0.881578 -3.030226
H  3.950593 1.562255 -1.288014
