program: Gaussian 09
title: 000200431
version: EM64L-G09RevD.01
frameworkgroup: C1[X(C14H12N2S)]
method: RPBEPBE
basis: SDD
operation: Freq
keyword: #p
keyword: freq=noraman
keyword: PBEPBE/SDD
title: #p freq=noraman PBEPBE/SDD
converged: YES YES NO NO
title: Mulliken charges:
elementType: S N N C C C C C C C C C C C C C C H H H H H H H H H H H H
charge: 0.204990 -0.191340 -0.109427 0.105248 0.183164 0.351143 -0.336911 -0.188668 -0.329151 -0.385858 -0.387696 -0.231162 -0.183466 -0.170269 -0.230216 -0.223265 -0.865804 0.256193 0.245898 0.258168 0.214651 0.281120 0.228514 0.238872 0.234393 0.239885 0.261862 0.264642 0.264491
chargesum: 0.00000
title: Mulliken charges with hydrogens summed into heavy atoms:
elementType: S N N C C C C C C C C C C C C C C
charge: 0.204990 -0.191340 -0.109427 0.105248 0.183164 0.351143 -0.080718 0.057229 -0.070983 -0.171207 -0.106576 -0.002648 0.055407 0.064124 0.009669 -0.223265 -0.074810
polarizability: 3.97948507e+02 3.31229924e+00 1.71181900e+02 -1.82985446e-02 -9.80684106e-03 7.27066112e+01
1716.lowfreq: -8.4031 -4.9018 -1.8382 0.0020 0.0030 0.0032 34.3426 39.8127 54.4604
frequency: 33.8802 39.8116 54.3887 73.6774 117.8256 173.5861 214.7505 226.6159 232.5901 248.7186 298.3997 355.5524 362.6963 404.6035 433.7427 451.0600 509.3532 522.6741 566.8475 590.9927 611.7394 631.6686 665.7208 671.9091 707.3900 709.1928 738.5408 743.5731 756.4212 776.4780 821.4897 833.9972 852.5185 896.9516 917.4737 923.3703 945.8021 967.4708 967.5915 987.8192 991.1969 1003.5992 1006.6158 1054.8976 1078.8366 1117.5966 1119.1312 1144.3105 1195.9747 1205.2088 1235.1556 1250.1695 1281.9988 1307.0226 1333.5280 1349.3632 1366.3095 1375.9633 1413.5879 1443.8368 1454.4543 1459.8333 1466.5999 1506.9597 1523.2480 1547.2813 1565.7031 1614.7000 1634.0435 3006.9999 3123.6757 3126.1560 3133.9961 3134.0775 3154.3022 3157.1657 3167.5014 3168.1220 3184.7776 3193.1257 3241.1500
redmass: 3.6013 5.0114 4.3823 5.3879 6.1243 3.6511 1.3359 8.9376 3.9134 2.8518 5.0566 5.1633 4.3693 2.8639 3.0291 8.0350 2.9502 5.0432 3.1465 7.2234 6.5715 6.9197 1.8172 7.1836 6.9350 2.5493 2.0829 3.3606 2.0003 4.6712 1.4601 1.4410 1.4440 7.4180 6.3989 1.3447 1.3878 1.1938 1.2743 1.3823 1.3520 2.9151 2.5149 3.3457 2.5548 1.6205 1.4434 1.2963 1.1452 1.6188 2.9553 2.1603 2.4568 1.5517 2.1276 1.1553 5.1604 2.3789 3.7930 2.8172 1.0522 1.6694 1.4367 4.8501 5.7941 5.3853 7.0123 6.1402 6.8288 1.0290 1.1062 1.0880 1.0912 1.1000 1.0873 1.0943 1.0954 1.0894 1.0962 1.1011 1.0986
irintensity: 0.1216 1.9713 0.8951 0.6932 2.0412 1.6092 0.0221 1.3662 2.4881 0.0000 1.3361 4.3505 3.4371 0.0194 6.3727 15.2563 28.9792 3.1756 0.0972 1.5455 0.0054 0.3476 3.0748 1.0277 6.3722 0.8007 16.0437 13.4255 140.3336 2.6113 21.4747 0.0285 29.4328 1.5976 1.1724 1.5509 1.3218 7.3780 3.4128 15.6960 0.9223 11.0515 5.7000 29.1113 32.6088 7.7063 15.3169 21.5553 10.3126 5.7066 75.8738 7.7247 26.7837 0.3463 44.2949 1.4760 7.0296 68.9857 4.4390 63.5866 15.3207 121.4700 9.9588 5.8666 18.6436 1.4927 1.6566 85.7837 2.2062 30.6709 19.0828 18.8718 3.5668 9.7059 4.9806 16.0259 2.0275 3.1822 7.3464 12.0292 0.6236
temp: 298.150 k
press: 1.00000 atm
elementType: 16 7 7 6 6 6 6 6 6 6 6 6 6 6 6 6 6 1 1 1 1 1 1 1 1 1 1 1 1
symmnumber: 1
zpe: 585434.8 jmol-1
zpe.correction: 0.222980 hartree
zpe.thermalcorrener: 0.237328 hartree
zpe.thermalcorrenthalpy: 0.238272 hartree
zpe.thermalcorrgfe: 0.180203 hartree
zpe.sumelectzpe: -1047.074788 hartree
zpe.sumelectthermal: -1047.060440 hartree
zpe.sumelectthermalent: -1047.059496 hartree
zpe.sumelectthermalfe: -1047.117566 hartree
dipole: -1.8122 4.1701 0.0066
dipole: 4.5468
quadrupole: -79.9074 -94.4755 -114.3150
quadrupole: 4.2733 0.0295 -0.0038
quadrupole: 16.3252 1.7571 -18.0823 4.2733 0.0295 -0.0038
hfenergy: -1047.2977686 hartree
pointgroup: C01 [X(C14H12N2S1)]
dipole: -0.6996122 -1.6456234 0.0500962 debye
polarizability: 397.6270219|-1.7017627|171.1138167|-10.783851|-1.7086214|73.0961797 unknown
InChI: InChI=1S/C14H12N2S/c1-17-12-7-5-11(6-8-12)13-10-16-9-3-2-4-14(16)15-13/h2-10H,1H3
charge 0 multiplicity 1
29 atoms
S  5.566025 0.603032 -0.29664
N  -2.671494 -0.774345 0.001327
N  -1.354993 1.109088 -0.076505
C  -0.550534 -0.038956 -0.081658
C  -2.637012 0.668359 -0.025769
C  0.916003 0.060335 -0.132265
C  -1.345707 -1.20554 -0.034137
C  -3.868428 -1.477654 0.053385
C  -3.871933 1.37278 0.002062
C  1.752536 -1.086035 -0.139017
C  1.532684 1.341972 -0.176847
C  -5.066123 -0.775392 0.080122
C  -5.072913 0.660851 0.054362
C  3.156643 -0.966295 -0.18823
C  2.931034 1.470202 -0.226292
C  3.757638 0.3148 -0.232222
C  6.259984 -1.139934 -0.294587
H  -1.087199 -2.260124 -0.02389
H  -3.80636 -2.56815 0.071094
H  -3.839147 2.464687 -0.018764
H  1.312309 -2.089567 -0.105861
H  0.888328 2.226317 -0.171939
H  -6.003985 -1.335346 0.121171
H  -6.027283 1.195453 0.076047
H  3.766824 -1.874685 -0.191703
H  3.384944 2.467087 -0.260626
H  7.353218 -1.017178 -0.335353
H  5.919367 -1.696561 -1.18166
H  5.983977 -1.668905 0.630994
