program: Gaussian 09
title: 000200455
version: EM64L-G09RevD.01
frameworkgroup: C1[X(C17H22N2)]
method: RPBEPBE
basis: SDD
operation: Freq
keyword: #pfreq=noraman
keyword: PBEPBE/SDD
title: #p freq=noraman PBEPBE/SDD
converged: YES YES NO NO
title: Mulliken charges:
elementType: N N C C C C C C C C C C C C C C C C C H H H H H H H H H H H H H H H H H H H H H H
charge: -0.252664 -0.104238 -0.423175 -0.433306 -0.338574 0.371863 0.382457 -0.626761 -0.610022 -0.376546 -0.381540 -0.383425 -0.379650 -0.238291 -0.215092 -0.222896 -0.221734 -0.274432 -0.262389 0.237194 0.210043 0.252564 0.233246 0.194773 0.199324 0.243763 0.191191 0.220765 0.189772 0.225293 0.222112 0.258894 0.269829 0.264139 0.236282 0.220868 0.224400 0.221346 0.221949 0.225255 0.227412
chargesum: 0.00000
title: Mulliken charges with hydrogens summed into heavy atoms:
elementType: N N C C C C C C C C C C C C C C C C C
charge: -0.252664 -0.104238 0.024062 0.052504 0.055523 0.371863 0.382457 0.028957 0.027155 -0.117652 -0.111711 -0.119286 -0.143368 -0.017422 0.009309 -0.001550 0.000214 -0.049177 -0.034977
polarizability: 2.52315907e+02 3.36516423e+01 2.38581146e+02 6.02897228e+00 8.01895410e+00 1.24776876e+02
1716.lowfreq: -8.5613 -1.3285 -0.0002 0.0004 0.0005 5.1478 18.7325 36.0804 42.1066
frequency: 18.4904 36.0632 42.0525 60.3269 69.8413 82.7439 93.1919 102.3812 202.9574 206.6970 219.6903 235.2804 255.1687 273.9241 295.3475 320.4736 368.3682 370.9649 401.1965 408.1225 413.7885 416.6571 458.8705 507.6469 519.7268 590.4275 612.3036 614.2870 624.8345 694.0051 699.5909 724.0420 726.8170 753.9882 763.0511 803.8625 828.6713 840.4685 863.0059 881.1434 893.3625 904.7789 963.6037 969.6625 970.1258 978.8853 980.3401 983.8817 987.0689 1022.7720 1028.6674 1032.3220 1052.2170 1062.8025 1065.6363 1079.4799 1087.6724 1094.3358 1102.8449 1136.7577 1165.7396 1170.1957 1172.4750 1187.2100 1200.3854 1213.7427 1245.2271 1256.2717 1271.3591 1281.4998 1311.0715 1317.3051 1333.6526 1352.9035 1362.4481 1367.8691 1378.8531 1384.3736 1417.5884 1439.7422 1440.0159 1451.1418 1459.8047 1462.4208 1471.1899 1475.4996 1479.8570 1484.4102 1484.8056 1488.1246 1513.3231 1575.6761 1584.8681 1604.8954 1617.5893 2850.8874 2852.9069 2869.6822 2992.1399 3000.6084 3006.4239 3018.8983 3029.0823 3045.9138 3072.0584 3077.3489 3087.7103 3121.2865 3122.8524 3128.6397 3130.0515 3146.4317 3150.8798 3154.3766 3157.9694 3166.8833 3168.3626
redmass: 3.7348 3.5728 3.3150 3.5163 3.9946 3.3860 3.9229 3.5779 1.6680 2.0628 1.1952 4.0170 1.9585 3.8817 2.2851 4.9200 2.0041 2.7904 3.1637 2.8541 2.8058 2.8682 3.1568 3.0403 3.2897 4.6190 5.6548 6.2751 4.8460 1.9646 2.2539 3.0164 1.8215 1.7551 1.9453 1.9270 1.2944 1.2531 2.4829 2.2178 1.4564 1.4465 1.3680 1.6220 1.7103 2.7940 1.7238 5.2193 1.2962 2.5956 2.2319 1.5480 2.4124 2.5885 1.7250 2.2292 1.4757 1.5321 1.7836 1.4620 1.5265 1.0574 1.1145 1.1308 1.1272 1.5610 3.0951 2.2707 1.6399 1.4656 1.4117 1.2735 1.3986 1.7305 1.4556 1.7304 2.8850 7.7535 1.1407 1.4576 1.7281 2.4737 1.0603 1.0546 1.0956 1.0714 1.0750 1.7208 1.2866 2.1653 1.1027 5.6847 6.3769 5.9978 6.0579 1.0653 1.0586 1.0597 1.0629 1.0731 1.0783 1.0731 1.0732 1.0972 1.1013 1.1008 1.1002 1.0845 1.0844 1.0888 1.0881 1.0926 1.0923 1.0952 1.0947 1.1011 1.1000
irintensity: 0.2573 0.9342 1.4922 1.4550 0.4315 0.6681 0.1219 0.3798 2.0967 0.7448 1.2787 0.7169 0.6229 2.8815 8.6900 0.2271 1.7648 6.4277 1.9431 4.5000 0.8898 1.5273 0.7136 17.5278 16.6661 5.4277 0.9958 0.4764 2.4012 52.1289 20.8604 8.8712 24.6509 110.3584 14.8877 18.3063 2.7055 0.6130 1.8281 12.1047 10.4069 2.0799 0.3599 16.1954 19.3915 2.2100 2.8189 0.9290 0.2762 4.1980 15.9575 16.8838 3.8889 7.3402 3.5072 28.0738 11.1833 10.1790 18.5315 3.7205 39.9091 1.1286 4.2695 7.6036 6.6601 45.3987 56.0225 43.9451 7.3078 22.2326 8.2019 1.6219 9.2589 83.5171 28.5582 2.3704 25.5425 6.2635 3.1713 2.4481 2.5157 1.2868 4.8438 10.1413 7.6893 25.8250 13.7681 89.9058 65.6462 198.2110 12.7286 22.7769 5.3193 228.7960 37.9553 47.4592 58.3184 314.9629 17.0767 8.5334 52.0018 41.6015 29.1810 9.4449 28.3147 40.9772 35.4470 7.5944 7.1140 15.1642 6.7678 33.3636 27.9861 32.1380 10.6212 20.2250 9.3974
temp: 298.150 k
press: 1.00000 atm
elementType: 7 7 6 6 6 6 6 6 6 6 6 6 6 6 6 6 6 6 6 1 1 1 1 1 1 1 1 1 1 1 1 1 1 1 1 1 1 1 1 1 1
symmnumber: 1
zpe: 918568.2 jmol-1
zpe.correction: 0.349864 hartree
zpe.thermalcorrener: 0.368223 hartree
zpe.thermalcorrenthalpy: 0.369167 hartree
zpe.thermalcorrgfe: 0.301647 hartree
zpe.sumelectzpe: -769.074164 hartree
zpe.sumelectthermal: -769.055805 hartree
zpe.sumelectthermalent: -769.054861 hartree
zpe.sumelectthermalfe: -769.122382 hartree
dipole: 1.7434 -1.6211 -0.4363
dipole: 2.4203
quadrupole: -102.2074 -108.3106 -118.2313
quadrupole: -1.7388 0.6787 2.0925
quadrupole: 7.3757 1.2725 -8.6482 -1.7388 0.6787 2.0925
hfenergy: -769.4240282 hartree
pointgroup: C01 [X(C17H22N2)]
dipole: 0.7255464 -0.6051302 -0.1187776 debye
polarizability: 247.3933221|32.9883678|241.151516|16.9971658|13.1554532|127.129091 unknown
InChI: InChI=1S/C17H22N2/c1-18(2)14-9-15-19(16-10-5-3-6-11-16)17-12-7-4-8-13-17/h3-8,10-13H,9,14-15H2,1-2H3
charge 0 multiplicity 1
41 atoms
N  -0.454129 -0.229582 0.064595
N  3.775114 -1.045094 0.541945
C  1.691683 -1.239419 -0.867973
C  0.691401 -1.141132 0.30883
C  3.019529 -1.889601 -0.421301
C  -0.225465 1.174628 0.026005
C  -1.754333 -0.802881 -0.096074
C  4.442798 0.103705 -0.108258
C  4.728396 -1.833052 1.352427
C  0.952032 1.746439 0.596644
C  -2.900111 -0.213841 0.512424
C  -1.138352 2.051092 -0.63676
C  -1.921765 -2.018027 -0.818521
C  1.178788 3.138349 0.533107
C  -4.167402 -0.817832 0.389045
C  -0.899232 3.437565 -0.690949
C  -3.192515 -2.623357 -0.925674
C  0.257911 4.001158 -0.101553
C  -4.326844 -2.027735 -0.328993
H  1.878126 -0.229024 -1.275761
H  1.256381 -1.834803 -1.694633
H  1.249048 -0.814324 1.206293
H  0.281066 -2.138398 0.542561
H  3.638624 -2.135102 -1.321815
H  2.796104 -2.851845 0.081261
H  3.706095 0.729298 -0.639217
H  5.226926 -0.210502 -0.843759
H  4.926263 0.733053 0.660264
H  5.541561 -2.306576 0.745524
H  4.190549 -2.63401 1.890096
H  5.205749 -1.17846 2.103853
H  1.69444 1.11436 1.093211
H  -2.785608 0.704449 1.096896
H  -2.026337 1.638945 -1.124768
H  -1.060249 -2.476755 -1.315643
H  2.087838 3.547798 0.98959
H  -5.032416 -0.349869 0.873186
H  -1.619038 4.080927 -1.210575
H  -3.296404 -3.557047 -1.490545
H  0.439742 5.080023 -0.145856
H  -5.312969 -2.495728 -0.417725
