program: Gaussian 09
title: 000200596
version: EM64L-G09RevD.01
frameworkgroup: C1[X(C14H26N2O12)]
method: RPBEPBE
basis: SDD
operation: Freq
keyword: #p
keyword: freq=noraman
keyword: PBEPBE/SDD
title: #p freq=noraman PBEPBE/SDD
converged: YES YES NO NO
title: Mulliken charges:
elementType: O O O O O O O O O O O O N N C C C C C C C C C C C C C C H H H H H H H H H H H H H H H H H H H H H H H H H H
charge: -0.253408 -0.321117 -0.277939 -0.461716 -0.457119 -0.448214 -0.286802 -0.442954 -0.429481 -0.431537 -0.473718 -0.230840 0.007169 0.066325 -0.071459 -0.144478 -0.142028 -0.160468 -0.142127 -0.050019 -0.041069 -0.267505 -0.049483 0.005799 -0.370034 -0.344204 -0.395465 -0.625114 0.202875 0.231800 0.253522 0.321247 0.284401 0.227359 0.190345 0.345162 0.203008 0.230230 0.193925 0.255550 0.217740 0.264409 0.384654 0.359021 0.356361 0.356647 0.327865 0.263536 0.234863 0.343846 0.380365 0.263385 0.277068 0.269822
chargesum: 0.00000
title: Mulliken charges with hydrogens summed into heavy atoms:
elementType: O O O O O O O O O O O O N N C C C C C C C C C C C C C C
charge: -0.253408 -0.321117 -0.277939 -0.077062 -0.098098 -0.091853 -0.286802 -0.086307 -0.101616 -0.087692 -0.093353 -0.230840 0.007169 0.066325 0.131416 0.087322 0.111495 0.160779 0.142274 0.177340 0.149276 0.077658 0.153525 0.236029 0.079441 0.137945 0.102935 0.185161
polarizability: 2.47180003e+02 1.62361729e+01 2.17019481e+02 1.92451063e+00 -7.02978301e+00 1.77772596e+02
1716.lowfreq: -5.0789 -2.0594 -0.0009 -0.0008 -0.0005 5.4131 12.4144 21.4849 26.5218
frequency: 11.8823 21.4335 26.3094 37.4020 41.8095 55.5259 66.3317 70.8718 81.7120 102.3072 112.4461 114.6873 121.1258 125.9905 149.3534 156.3249 172.2388 191.3993 200.9560 224.6116 233.5401 238.3634 242.0428 247.1808 274.2332 287.2754 303.4059 325.3126 337.1228 346.9434 353.1994 367.1571 373.3404 377.3448 392.9782 400.3968 407.6094 418.0508 426.8037 436.1499 440.8992 464.5289 480.8542 501.4520 507.4392 509.9297 522.4863 540.1810 553.6478 576.4163 581.6463 590.2903 627.3636 631.2812 643.4537 748.3785 753.9951 767.2164 814.7274 839.9530 857.0183 865.1648 889.0749 921.1739 934.6407 951.8989 955.8904 967.6123 969.2163 978.2843 992.3115 997.4490 1000.2255 1009.0060 1011.1469 1027.1115 1043.2783 1050.2344 1052.8932 1064.1481 1072.4319 1074.3410 1079.7317 1088.4783 1090.3594 1105.3072 1109.6544 1111.9179 1125.1208 1154.9596 1178.2188 1186.8126 1190.3414 1202.5651 1217.9326 1232.2072 1246.5194 1256.4306 1263.5974 1264.0379 1270.6039 1276.5736 1280.3760 1289.7856 1297.6216 1313.5952 1317.3763 1324.7108 1331.5235 1333.2979 1335.8147 1347.2166 1348.5129 1353.4898 1358.0051 1362.1408 1372.5468 1375.6081 1376.9258 1378.5197 1383.0473 1384.3984 1387.9575 1403.6925 1455.3276 1462.3529 1464.5589 1471.8057 1483.1610 1488.1029 2905.9471 2945.3570 2953.8846 2954.0371 2970.3666 2972.0515 3006.7650 3010.5058 3017.9729 3021.3129 3022.2583 3083.7791 3093.5709 3100.8089 3102.7332 3107.0957 3109.1863 3117.0211 3131.5566 3169.9433 3454.8692 3507.3842 3513.1418 3543.7641 3549.0586 3568.7656
redmass: 6.7400 7.8112 5.6015 7.1760 5.5455 4.5971 5.3683 5.2520 4.7721 5.0250 5.1188 6.0515 5.6745 4.0149 3.9396 1.2954 3.8761 5.8758 5.6536 4.2695 4.3984 4.3879 4.5295 5.0266 4.8900 4.5037 3.8264 4.3120 1.3113 3.0875 2.9432 1.7451 2.7763 1.8924 2.6417 2.1456 1.5458 3.6465 2.1084 1.7780 4.1627 3.0696 3.2303 3.3473 4.2371 3.5432 4.4787 3.9529 3.1113 4.0601 3.5983 3.5018 3.3325 4.3511 3.5484 6.4304 5.3515 1.1584 4.2598 2.8670 4.7887 5.4328 2.7122 3.9585 6.5430 3.5381 6.2709 3.1671 4.9169 6.8898 3.5765 6.1122 4.9910 3.9044 3.0744 3.9075 4.0004 3.0373 3.1392 2.4466 1.8993 2.5849 2.9534 3.2532 1.4901 1.8831 2.6725 2.9322 2.2083 1.1023 1.2553 1.2512 1.3216 1.4827 1.3799 1.2595 1.3174 1.3670 1.4757 1.7637 1.2583 1.2384 1.2222 1.4221 1.1934 1.2109 1.2542 1.2539 1.1991 1.2670 1.2258 1.2341 1.2375 1.3026 1.3787 1.3812 1.5029 1.3341 1.3042 1.3199 1.4121 1.2806 1.2493 2.8034 1.1300 1.0857 1.1436 1.0698 1.0708 1.1632 1.0829 1.0838 1.0806 1.0832 1.0782 1.0760 1.0837 1.0679 1.0435 1.0849 1.0493 1.0880 1.0767 1.0845 1.0872 1.1008 1.1047 1.0938 1.1022 1.1047 1.0636 1.0657 1.0656 1.0657 1.0655 1.0658
irintensity: 2.2559 1.8187 3.4558 2.8563 0.9466 5.2340 1.8827 9.7854 3.9612 5.2682 3.6704 1.4525 3.0297 2.6966 0.2072 0.3454 2.9722 1.3439 7.6818 17.5041 25.5811 14.9063 13.9508 18.4712 2.5911 15.1690 6.6775 9.0398 37.2118 24.1984 40.6911 104.9180 53.0506 23.7667 9.1502 83.4036 96.9584 37.2249 124.0411 102.8414 12.2680 127.0335 9.8963 45.0269 8.9856 24.9481 26.6507 5.0951 56.9705 23.4000 6.0840 4.0326 38.5840 18.0371 38.4843 32.6788 92.1221 210.9802 10.0351 43.1735 113.7010 16.9269 28.0935 92.9067 259.7369 11.1465 77.5429 95.2300 84.5042 201.4655 25.1806 94.4843 217.8147 13.8531 70.9032 25.3339 86.0612 29.4919 180.2138 29.7084 18.2742 42.0937 28.0448 17.6055 5.3115 39.9002 13.7128 12.1833 21.4772 18.2858 6.6463 66.2994 5.4072 21.5253 31.9343 9.0542 30.3262 23.6958 23.6631 15.1216 16.9160 14.7838 12.6353 8.4636 13.5331 20.3331 1.0983 8.8040 17.9073 4.2489 11.8554 27.7891 21.0369 1.2144 16.9296 7.8112 16.7497 1.8869 15.0095 10.5115 15.5886 22.2342 21.4532 212.8641 10.7261 13.5190 68.9018 21.3234 2.1880 11.3046 50.1218 12.1599 2.9019 47.7572 4.7916 67.9723 19.9731 163.5301 10.9313 78.9450 43.8075 3.0350 482.1027 153.7824 6.6589 3.4612 6.3296 3.5690 4.7939 0.2530 34.1396 3.6890 7.9962 11.8317 5.8522 7.6455
temp: 298.150 k
press: 1.00000 atm
elementType: 8 8 8 8 8 8 8 8 8 8 8 8 7 7 6 6 6 6 6 6 6 6 6 6 6 6 6 6 1 1 1 1 1 1 1 1 1 1 1 1 1 1 1 1 1 1 1 1 1 1 1 1 1 1
symmnumber: 1
zpe: 1116832.7 jmol-1
zpe.correction: 0.425379 hartree
zpe.thermalcorrener: 0.455321 hartree
zpe.thermalcorrenthalpy: 0.456265 hartree
zpe.thermalcorrgfe: 0.362901 hartree
zpe.sumelectzpe: -1558.836809 hartree
zpe.sumelectthermal: -1558.806867 hartree
zpe.sumelectthermalent: -1558.805923 hartree
zpe.sumelectthermalfe: -1558.899287 hartree
dipole: 0.8150 -3.8812 -1.2546
dipole: 4.1596
quadrupole: -139.8984 -193.3603 -173.1255
quadrupole: 9.8551 38.8977 -0.8020
quadrupole: 28.8964 -24.5656 -4.3308 9.8551 38.8977 -0.8020
hfenergy: -1559.2621883 hartree
pointgroup: C01 [X(C14H26N2O12)]
dipole: -0.3203751 1.5359404 0.4651592 debye
polarizability: 247.3036083|15.3173663|198.0929045|6.2444309|20.5294705|196.5755663 unknown
InChI: InChI=1S/C14H26N2O12/c1-16(24)15-4-25-13-11(23)12(8(20)6(3-18)26-13)28-14-10(22)9(21)7(19)5(2-17)27-14/h5-14,17-23H,2-4H2,1H3
charge 0 multiplicity 1
54 atoms
O  -1.352196 0.600242 -0.240426
O  -2.470778 0.106382 1.890125
O  2.293292 -0.970538 -1.640974
O  -1.261883 -2.143693 -1.217147
O  1.178107 1.562156 0.90334
O  -3.39048 2.826066 1.864321
O  3.478871 0.848208 -0.723182
O  -4.162525 1.95668 -1.484403
O  -5.400534 -0.63496 -0.439127
O  2.5164 -3.604915 -2.724683
O  -2.086082 -2.421365 1.325911
O  6.019813 0.793975 2.668264
N  5.250843 -0.0916 0.709998
N  5.641076 0.945656 1.43611
C  -0.100387 -0.174002 -0.180361
C  -0.165863 -1.202445 -1.336631
C  1.120141 0.751529 -0.317594
C  -1.861516 1.142465 0.991167
C  -2.954907 2.159336 0.628946
C  1.185979 -1.956337 -1.449731
C  -4.150208 1.481489 -0.103145
C  -4.099385 -0.05935 -0.041768
C  -3.723977 -0.543715 1.377338
C  2.403097 -0.087983 -0.477352
C  1.246421 -2.878198 -2.668731
C  -3.510344 -2.081563 1.484684
C  4.827292 0.225045 -0.67438
C  5.712447 2.378704 0.917012
H  -0.023564 -0.697332 0.797438
H  -0.336443 -0.644208 -2.277646
H  1.009284 1.38532 -1.221022
H  -1.063705 1.571807 1.618663
H  -2.55267 2.94812 -0.023482
H  1.381474 -2.544752 -0.525631
H  -5.070961 1.820336 0.430371
H  -3.392373 -0.447928 -0.790265
H  -4.538785 -0.245642 2.072703
H  2.60691 -0.691008 0.436743
H  1.084686 -2.276732 -3.588616
H  0.455009 -3.63774 -2.590473
H  -3.85492 -2.456321 2.46636
H  -4.059621 -2.599034 0.683121
H  -1.504648 -2.330585 -0.248561
H  1.94653 2.182322 0.826298
H  -3.370125 2.156631 2.599004
H  -4.786643 1.386389 -2.004063
H  -6.115415 -0.24783 0.133511
H  4.804392 -0.737067 -1.208529
H  5.475067 0.941697 -1.210258
H  3.242393 -2.929356 -2.709022
H  -1.601682 -1.748059 1.8802
H  6.634616 2.49462 0.32348
H  5.760291 3.016724 1.80816
H  4.828185 2.607056 0.304635
