program: Gaussian 09
title: 000200417
version: EM64L-G09RevD.01
frameworkgroup: C1[X(C11H11NOS2)]
method: RPBEPBE
basis: SDD
operation: Freq
keyword: #p
keyword: freq=noraman
keyword: PBEPBE/SDD
title: #p freq=noraman PBEPBE/SDD
converged: NO YES NO NO
title: Mulliken charges:
elementType: S S O N C C C C C C C C C C C H H H H H H H H H H H
charge: 0.308687 0.155920 -0.184649 -0.200855 -0.556443 0.271544 0.489623 -0.601237 -0.628744 -0.333439 -0.324600 0.451382 -0.376750 -0.370074 -0.805122 0.308453 0.236877 0.253658 0.237674 0.244274 0.258029 0.234852 0.234923 0.240056 0.227808 0.228156
chargesum: 0.00000
title: Mulliken charges with hydrogens summed into heavy atoms:
elementType: S S O N C C C C C C C C C C C
charge: 0.308687 0.155920 -0.184649 -0.200855 -0.247990 0.271544 0.489623 -0.601237 0.099464 -0.089166 -0.066571 0.451382 -0.141899 -0.135151 -0.109102
polarizability: 2.17659012e+02 1.03007155e+01 1.64873468e+02 1.06958363e+00 9.54117644e+00 1.07718515e+02
1716.lowfreq: -8.8421 -4.7469 -0.0023 -0.0006 0.0021 0.1717 28.0226 36.0456 44.9292
frequency: 27.7951 35.8338 44.9164 58.5492 62.4163 122.6237 166.6109 199.3365 218.3353 255.4097 289.7295 304.5082 331.1294 353.8535 397.9271 407.9917 420.4720 471.0420 500.5589 516.1962 551.0332 577.7047 636.0472 680.7771 709.7281 719.6131 743.9231 805.2341 822.2336 838.0426 890.2330 950.9446 970.0259 988.5974 999.9516 1007.1258 1015.1678 1048.1936 1061.3188 1073.9288 1122.6852 1165.4094 1191.6023 1197.4392 1222.2433 1227.9195 1277.1775 1300.1335 1308.0226 1376.5095 1390.7108 1398.3559 1407.7955 1466.5118 1471.4487 1473.3532 1474.7039 1504.2220 1593.2645 1620.3399 1637.1834 2978.2522 2998.3496 3045.1389 3060.2962 3089.1769 3100.2945 3109.8444 3131.4401 3133.5736 3163.0860 3167.6485
redmass: 1.1015 3.0133 4.8531 5.1031 8.1010 6.7178 4.8055 5.5462 1.0482 4.1848 7.4772 3.7096 3.7538 4.9719 13.2565 2.8615 5.3758 4.7674 15.6842 3.8416 7.6302 5.0744 6.6915 4.1728 4.4226 3.5663 4.6698 2.9918 2.0447 1.2552 3.4889 1.3551 1.3873 1.4243 2.0702 3.2735 2.9443 1.5731 2.1553 2.2786 1.2856 3.0028 1.2163 1.4096 2.8979 5.9012 1.3631 5.3811 1.4123 5.9732 1.1833 1.2205 3.2014 1.0454 1.0985 1.0492 1.0550 2.7200 6.7441 6.6560 11.5410 1.0388 1.0349 1.0844 1.0948 1.0999 1.1003 1.1014 1.0894 1.0893 1.0958 1.0967
irintensity: 0.7605 0.1662 2.8813 1.7498 0.3109 0.7761 1.0948 0.9735 0.4360 7.0252 0.1720 1.6038 3.6914 1.8205 2.7748 0.0646 5.3012 8.4609 3.0339 25.0445 4.8828 16.1676 0.8343 0.1038 4.9421 3.4040 34.6536 10.8143 28.9839 0.3971 3.2189 3.5252 0.1825 0.8446 19.1247 11.1757 23.3001 19.1767 29.0498 15.0605 11.3180 29.2663 12.3911 6.1175 6.4313 488.8673 4.6484 101.3018 15.1243 2.8836 16.8000 13.1401 2.2169 20.6301 12.7767 7.8930 13.1592 61.3258 1.5095 18.8713 183.8393 30.5852 19.0623 2.4023 19.9872 16.5824 8.1757 16.8147 12.4169 18.8277 9.3861 0.9705
temp: 298.150 k
press: 1.00000 atm
elementType: 16 16 8 7 6 6 6 6 6 6 6 6 6 6 6 1 1 1 1 1 1 1 1 1 1 1
symmnumber: 1
zpe: 508886.6 jmol-1
zpe.correction: 0.193825 hartree
zpe.thermalcorrener: 0.208663 hartree
zpe.thermalcorrenthalpy: 0.209607 hartree
zpe.thermalcorrgfe: 0.149480 hartree
zpe.sumelectzpe: -1350.807233 hartree
zpe.sumelectthermal: -1350.792395 hartree
zpe.sumelectthermalent: -1350.791451 hartree
zpe.sumelectthermalfe: -1350.851578 hartree
dipole: 0.6420 -1.9040 0.3530
dipole: 2.0401
quadrupole: -82.3831 -116.7125 -96.7950
quadrupole: 6.9763 0.0469 3.9406
quadrupole: 16.2471 -18.0823 1.8352 6.9763 0.0469 3.9406
hfenergy: -1351.001058 hartree
pointgroup: C01 [X(C11H11N1O1S2)]
dipole: -0.2013367 -0.7013415 -0.334346 debye
dipolederiv: -0.6830834 0.2014148 0.0446354 0.1800244 -0.1393013 -0.0697654 0.0656846 -0.0487931 -0.0255891 -0.4345103 0.2828532 0.0956325 0.2698181 -0.7120615 -0.1943778 0.0261088 -0.160739 -0.1389707 -0.4881475 -0.2603785 -0.0820094 0.0693414 -1.0928423 -0.2215187 0.040789 -0.2482787 -0.3575866 -0.8345803 0.2068264 0.0368141 -0.1031149 -1.5021824 -0.4157398 -0.0747836 -0.3755943 -0.1620091 -0.3555827 -0.0474429 -0.0222213 -0.0033497 0.3319788 0.0851207 -0.05772 0.050451 0.1541207 0.792447 -0.2353195 -0.0605385 -0.444169 1.4934958 0.3615641 -0.0092223 0.3555483 0.2456769 0.6142917 0.119057 0.0606806 0.0270681 -0.020404 -0.0803228 0.0600943 -0.0049306 0.1040956 1.2612689 -0.1945211 -0.0047782 -0.0720218 1.4633898 0.5273296 0.02559 0.4341708 -0.0513778 0.074981 -0.0344602 0.010714 0.0562464 -0.064804 -0.0749549 -0.0477829 0.0005273 0.0165507 -0.0049691 -0.0501626 0.0446958 0.0022503 -0.0152709 -0.0578389 -0.0746738 -0.0562258 -0.0311955 -0.0372347 0.0461221 -0.0266045 0.0255316 -0.0071798 -0.0567938 0.0550812 -0.0099371 -0.0343864 0.4718041 0.0562954 0.0595145 0.1009243 -0.0019743 0.0059079 0.1198178 -0.0025039 0.0032069 -0.2211313 0.0616743 -0.0813687 0.1014887 -0.0350472 -0.1091317 -0.1460724 -0.1139435 -0.0655026 -0.2094624 -0.0903859 0.0600886 -0.117301 -0.071109 -0.1218222 0.1095262 -0.1007051 -0.0136813 -0.1598711 -0.029888 -0.0316254 -0.1208708 0.0557797 -0.0204885 -0.1141575 -0.0223745 0.0578686 0.0638193 -0.0059841 -0.0079886 0.0373249 -0.0355309 0.0301099 0.0022779 0.025606 -0.0099954 -0.1301807 -0.0000762 -0.0011291 -0.052334 0.1182576 -0.0063045 -0.0340873 -0.0154056 0.0703718 0.1005055 -0.0354467 0.0104097 0.0191483 -0.0769021 -0.0562894 0.0526753 -0.0642966 0.0662922 0.0769609 0.0520754 -0.0604308 0.0161583 0.037996 0.1102264 -0.0245903 0.0600565 -0.0256335 0.0481266 0.0553192 -0.070547 0.0539815 0.0832741 0.075889 -0.0712437 0.0460653 0.0423912 0.0447142 -0.0515683 0.0546551 -0.0670623 0.0539817 0.0678431 0.0714265 0.0438448 0.0727319 -0.0014399 -0.0739569 0.0608976 -0.0732806 0.0508099 0.0952172 0.0634101 0.0959806 0.0488197 0.0102252 0.0432453 -0.0789429 0.0554356 0.0680007 0.1018461 -0.0744023 0.0890738 0.022537 -0.0151083 -0.0304172 -0.0301533 -0.0695699 -0.0126778 -0.1132545 -0.0645881 -0.1103859 0.0156612 0.0045549 -0.0115641 0.03682 -0.0204696 0.0936408 0.0609984 0.1384947 0.0504672 -0.0792071 0.0116024 0.0266888 -0.0172201 0.1288019 -0.0633174 0.0765507 -0.0376523 0.0823222 0.0748109 unknown
polarizability: 218.5573667|-7.6575399|164.9188021|2.9079589|5.3835143|106.7748267 unknown
InChI: InChI=1S/C11H11NOS2/c1-7-3-5-9(6-4-7)12-10(13)8(2)15-11(12)14/h3-6,8H,1-2H3
charge 0 multiplicity 1
26 atoms
S  3.340633 1.067592 0.723627
S  0.810754 2.778849 1.063721
O  1.235102 -2.156614 -0.266621
N  0.886578 0.112239 0.30832
C  3.189795 -0.766141 0.240368
C  1.692119 -1.038208 0.065553
C  -0.559493 0.021993 0.175391
C  1.531136 1.311655 0.682857
C  3.988579 -1.116598 -1.028189
C  -1.281506 -0.837133 1.029488
C  -1.224141 0.772688 -0.817114
C  -3.374829 -0.196462 -0.102143
C  -2.680604 -0.941045 0.885761
C  -2.623678 0.662464 -0.946099
C  -4.877409 -0.334586 -0.268621
H  3.548106 -1.357505 1.101191
H  5.06889 -0.96838 -0.862616
H  3.812178 -2.176001 -1.285774
H  3.676036 -0.489909 -1.880334
H  -0.756564 -1.418115 1.793956
H  -0.655595 1.440512 -1.471141
H  -3.240429 -1.608254 1.551277
H  -3.139369 1.252047 -1.71293
H  -5.122378 -1.145524 -0.981809
H  -5.370245 -0.57987 0.688286
H  -5.329971 0.593507 -0.658902
