program: Gaussian 09
title: 000200414
version: EM64L-G09RevD.01
frameworkgroup: C1[X(C6H7N5O3)]
method: RPBEPBE
basis: SDD
operation: Freq
keyword: #pfreq=noraman
keyword: PBEPBE/SDD
title: #p freq=noraman PBEPBE/SDD
converged: NO YES NO NO
title: Mulliken charges:
elementType: O O O N N N N N C C C C C C H H H H H H H
charge: -0.439373 -0.215763 -0.207190 -0.087864 -0.291830 0.069506 -0.229100 -0.431920 -0.382885 0.275033 -0.089603 -0.317301 0.194666 0.087646 0.278633 0.204301 0.372922 0.227092 0.197318 0.366070 0.419643
chargesum: 0.00000
title: Mulliken charges with hydrogens summed into heavy atoms:
elementType: O O O N N N N N C C C C C C
charge: -0.019730 -0.215763 -0.207190 -0.087864 0.081091 0.069506 -0.229100 -0.065850 0.100049 0.275033 -0.089603 0.107110 0.194666 0.087646
polarizability: 1.45244141e+02 -1.01951184e+01 1.42762244e+02 -1.28680826e+00 -5.97734161e-01 5.35073598e+01
1716.lowfreq: -7.9993 -7.1082 -0.0003 0.0007 0.0009 4.5120 46.7315 81.5836 121.6930
frequency: 46.7221 81.5799 121.6926 158.6705 165.2152 212.6165 219.0528 254.1388 291.1332 322.1592 338.9881 384.3475 451.2585 474.1402 485.5379 575.7195 586.9356 638.7530 670.1838 689.9153 707.1692 757.6012 783.8972 829.6598 856.3284 901.0413 934.9576 960.9596 1010.0032 1028.3815 1059.6152 1111.9304 1120.1371 1175.8443 1204.7029 1215.6985 1275.8079 1295.1635 1319.6884 1353.1458 1354.8234 1362.7343 1415.1631 1452.9660 1460.4835 1481.8568 1491.9222 1587.8987 1648.0171 1650.1153 2930.9134 2962.3730 2990.5247 3058.0174 3061.1753 3514.1866 3611.8555
redmass: 6.9558 3.1927 10.5245 7.7590 7.6261 4.9292 3.9535 2.3095 3.2932 6.9784 3.0482 8.6118 5.4780 6.5626 3.3871 9.0256 3.8510 3.6520 5.9866 4.2964 5.4826 2.8085 2.8504 8.1814 2.5725 1.3953 2.0423 3.0828 6.3494 4.9517 2.1649 5.4606 4.2775 5.2072 3.7571 1.2510 2.2247 1.8330 1.5295 3.2045 1.5073 1.3013 1.5744 1.3905 1.3046 2.5898 1.2595 8.4262 6.1061 9.2037 1.0669 1.0725 1.0573 1.0940 1.1052 1.0769 1.0845
irintensity: 5.4690 0.5000 1.7387 6.0542 5.3742 5.4954 3.9002 70.2552 3.8165 8.0680 25.9609 6.2006 5.1662 2.2023 2.4063 5.1856 32.2322 0.8487 6.6803 12.8687 3.0287 45.1810 86.5992 10.8772 4.0672 120.8182 32.1360 62.4784 6.8752 51.4472 2.9791 122.1622 138.7717 163.7972 83.3716 6.0809 13.2485 7.0415 28.6325 4.2720 4.5785 3.3018 9.7744 10.6961 12.0591 10.4560 73.1274 609.2645 400.2677 311.0855 453.8258 297.3382 30.6903 7.8835 17.5570 59.1871 234.7414
temp: 298.150 k
press: 1.00000 atm
elementType: 8 8 8 7 7 7 7 7 6 6 6 6 6 6 1 1 1 1 1 1 1
symmnumber: 1
zpe: 389417.5 jmol-1
zpe.correction: 0.148321 hartree
zpe.thermalcorrener: 0.160103 hartree
zpe.thermalcorrenthalpy: 0.161047 hartree
zpe.thermalcorrgfe: 0.110029 hartree
zpe.sumelectzpe: -731.200936 hartree
zpe.sumelectthermal: -731.189154 hartree
zpe.sumelectthermalent: -731.188210 hartree
zpe.sumelectthermalfe: -731.239228 hartree
dipole: 5.0656 -7.1731 0.6541
dipole: 8.8057
quadrupole: -86.4265 -91.1957 -79.2834
quadrupole: -23.7433 3.0535 2.0841
quadrupole: -0.7913 -5.5605 6.3518 -23.7433 3.0535 2.0841
hfenergy: -731.3492571 hartree
pointgroup: C01 [X(C6H7N5O3)]
dipole: -2.5950291 -2.1117144 0.8993465 debye
dipolederiv: -0.7895269 0.005623 -0.118105 0.0220599 -0.6639669 0.0844837 -0.0852718 0.0253624 -0.574097 -0.9546959 0.4040341 -0.1004324 0.3555807 -0.7461087 0.1311646 -0.0751629 0.1234824 -0.3855216 -0.6935453 -0.2737011 0.1540314 -0.2812951 -1.0690024 0.3347436 0.1624665 0.3371228 -0.5246182 -0.5446927 -0.2906837 0.1999979 0.4026952 -0.0906605 -0.0518363 -0.2600453 0.0418896 -0.0978045 -0.7305962 -0.5619601 0.2903494 -0.5734801 -0.0436971 -0.0031644 0.3420242 0.0329913 -0.2856377 0.506381 0.5210352 -0.3043099 0.3477073 -0.1301644 -0.0044697 -0.2002482 -0.0741389 -0.0192063 -1.1756858 -0.3518268 0.242344 -0.3454384 -0.9737156 0.3635676 0.2811514 0.338414 -0.4461685 -0.5767127 0.1886768 -0.0591022 0.3806179 -1.1523234 0.2975268 -0.1284029 0.3166442 -0.4701389 0.6758609 -0.0152921 -0.0627649 -0.1331867 0.0385178 0.161617 -0.0037751 0.2047504 0.0815411 0.1754585 0.2595901 -0.1173464 0.6133528 1.0235919 -0.4481747 -0.2368879 -0.4040648 0.3861841 -0.3815454 0.1157073 0.0003928 -0.4974423 -0.3526933 0.2250041 0.2478824 0.159145 -0.0727029 0.2702149 0.1764479 0.0536308 0.0630341 0.5515779 0.0125912 0.1410775 -0.0674186 0.4013375 1.3797189 -0.2539069 -0.0276925 -0.356659 1.2494813 -0.3809724 0.0117691 -0.3937329 0.4296164 1.7637218 0.2324076 -0.2783945 0.1279444 1.5304513 -0.5391583 -0.2450736 -0.5526691 0.5490587 -0.0395135 0.0036025 -0.0124932 0.0647967 0.0793809 -0.0635852 0.0466666 -0.0418008 -0.0549234 -0.0330033 -0.0481649 -0.0028685 -0.1213696 -0.1224838 0.0169957 -0.0078902 0.0128371 0.1017065 0.2826594 0.0832524 -0.0267358 0.1223658 0.3451351 -0.0059127 -0.0496992 -0.0100505 0.3809957 -0.1653051 -0.0008549 -0.0292674 0.0523482 0.0648886 0.0057783 -0.0142746 0.0228441 0.0913571 0.0782891 0.008654 0.081627 -0.0293131 -0.0862263 -0.1285611 0.0175831 -0.0907252 -0.1329213 0.2016362 0.0521073 -0.0050527 0.0447605 0.1792455 0.0647441 -0.0028357 0.0642335 0.3138833 0.7508821 -0.2547477 0.122192 -0.2590793 0.3687723 -0.0723821 0.0589467 -0.0451159 0.3280599 unknown
polarizability: 148.7623606|4.1505223|124.5442119|-11.8891733|-31.1527373|68.2071728 unknown
InChI: InChI=1S/C6H7N5O3/c12-2-1-11-4-3(9-10-11)5(13)8-6(14)7-4/h8,10,12H,1-2H2
charge 0 multiplicity 1
21 atoms
O  -2.429851 2.228994 -0.540674
O  3.0289 -1.772401 0.355678
O  1.728467 2.419715 -1.275052
N  -1.529338 -0.619716 0.436338
N  -1.277081 -1.902923 0.962985
N  0.027414 -2.247327 0.94179
N  -0.030387 1.076812 -0.477597
N  2.285913 0.311661 -0.447133
C  -2.890571 -0.031227 0.411639
C  -0.283708 -0.115704 0.068501
C  0.655165 -1.16891 0.401651
C  -3.085324 0.968077 -0.765594
C  2.089154 -0.966132 0.129127
C  1.323404 1.346953 -0.765303
H  -3.069182 0.508515 1.360039
H  -3.608825 -0.869944 0.322479
H  -2.014049 -2.513063 1.313279
H  -4.168456 1.178306 -0.822116
H  -2.77775 0.477068 -1.715304
H  3.255438 0.557911 -0.675887
H  -1.420438 2.063837 -0.611145
