program: Gaussian 09
title: 000200415
version: EM64L-G09RevD.01
frameworkgroup: C1[X(C10H12O4)]
method: RPBEPBE
basis: SDD
operation: Freq
keyword: #pfreq=noraman
keyword: PBEPBE/SDD
title: #p freq=noraman PBEPBE/SDD
converged: YES YES NO NO
title: Mulliken charges:
elementType: O O O O C C C C C C C C C C H H H H H H H H H H H H
charge: -0.462523 -0.282258 -0.253175 -0.435638 0.377095 -0.117943 0.054099 -0.481127 -0.362536 0.227624 -0.681285 0.193908 -0.382115 -0.518252 0.217812 0.302146 0.241042 0.217129 0.246574 0.232635 0.222704 0.363607 0.261100 0.215736 0.236347 0.367294
chargesum: 0.00000
title: Mulliken charges with hydrogens summed into heavy atoms:
elementType: O O O O C C C C C C C C C C
charge: -0.098916 -0.282258 -0.253175 -0.068343 0.377095 0.099869 0.054099 -0.178980 -0.121495 0.227624 0.015054 0.193908 -0.159411 0.194930
polarizability: 1.91825928e+02 6.54747605e+00 1.30821676e+02 2.54989689e+00 -5.43408688e+00 6.80095138e+01
1716.lowfreq: -10.0145 -9.8099 -0.0007 -0.0006 0.0003 6.4531 40.2903 62.2021 71.2931
frequency: 40.2663 62.1803 71.2694 103.5453 125.9804 133.0516 185.0496 210.3434 222.1105 253.3387 286.2328 310.7759 330.6689 351.8801 373.1694 386.4811 417.3487 460.2035 475.3566 505.5693 565.9801 595.5866 616.8902 701.4320 718.7052 730.7946 749.9248 797.1249 831.8854 888.5303 922.2044 934.6226 952.8928 1007.1600 1022.7279 1057.5306 1081.4607 1112.8380 1116.1206 1153.5631 1170.3514 1179.6675 1223.5065 1245.6792 1271.0232 1289.6908 1299.2814 1373.3084 1382.1520 1405.4944 1413.2504 1442.1209 1458.7903 1461.5873 1473.1071 1478.9240 1496.9319 1556.1722 1587.0690 1609.4771 2982.5290 2992.6866 2997.3498 3092.8967 3094.4689 3104.4437 3114.9662 3134.4806 3164.0656 3170.9342 3394.3421 3573.1598
redmass: 4.9088 2.3372 3.9990 5.5868 5.2049 1.5928 2.8330 1.1030 3.4281 3.7950 5.5150 4.6806 4.9365 3.5866 1.2214 6.7088 3.1221 2.7973 1.2893 4.8802 4.1822 4.7190 6.9199 4.4566 5.5408 4.0760 2.7746 1.5624 5.4351 2.8304 1.4034 1.4403 4.7790 1.9130 2.5381 2.7440 2.1780 1.2422 1.8449 1.3351 1.2065 2.0535 1.5902 1.8638 2.7978 1.9130 1.3264 1.4698 1.2363 5.5528 2.1143 1.4154 1.0614 1.0876 1.0535 1.0582 3.0302 7.4143 6.7478 6.9173 1.0343 1.0351 1.0833 1.0980 1.1001 1.1007 1.0895 1.1049 1.0940 1.0921 1.0638 1.0661
irintensity: 0.8215 5.2710 2.9560 0.9229 0.8419 2.5865 0.9993 0.1820 0.5776 2.3812 3.8821 3.4203 26.1363 10.4110 131.0289 22.9138 32.6145 38.4153 71.0436 2.2055 14.1641 3.0403 8.3877 26.5022 8.2282 16.3620 26.4856 30.9633 13.1849 12.5891 7.0505 17.6027 98.5317 44.9859 48.4921 90.4662 192.1132 7.1182 6.4851 21.9472 32.8611 36.0125 23.0915 132.0892 438.3749 62.6342 29.6274 107.9253 12.8839 3.9867 30.1463 31.3775 15.3897 24.4628 11.6891 27.2039 84.2206 140.6862 55.8310 32.4931 78.8618 20.1554 30.4811 34.0385 34.6141 21.2000 14.7706 14.1213 6.5617 4.5400 42.7039 61.9681
temp: 298.150 k
press: 1.00000 atm
elementType: 8 8 8 8 6 6 6 6 6 6 6 6 6 6 1 1 1 1 1 1 1 1 1 1 1 1
symmnumber: 1
zpe: 529327.8 jmol-1
zpe.correction: 0.201610 hartree
zpe.thermalcorrener: 0.216003 hartree
zpe.thermalcorrenthalpy: 0.216947 hartree
zpe.thermalcorrgfe: 0.160185 hartree
zpe.sumelectzpe: -688.075821 hartree
zpe.sumelectthermal: -688.061429 hartree
zpe.sumelectthermalent: -688.060485 hartree
zpe.sumelectthermalfe: -688.117247 hartree
dipole: 4.8004 4.6768 -0.7689
dipole: 6.7459
quadrupole: -87.3081 -73.5205 -85.3354
quadrupole: 0.0515 -8.9739 -0.4602
quadrupole: -5.2534 8.5341 -3.2807 0.0515 -8.9739 -0.4602
hfenergy: -688.2774316 hartree
pointgroup: C01 [X(C10H12O4)]
dipole: 1.9507897 1.7586908 -0.3812859 debye
dipolederiv: -0.7835447 -0.2345655 -0.0387605 -0.1260375 -0.4227333 -0.1647579 -0.0722131 -0.1533905 -0.5623287 -1.3459212 0.5600928 -0.0410126 0.6238042 -0.5857019 -0.0215823 -0.2582063 0.1563345 -0.3578983 -0.8769377 -0.1245209 0.0051646 -0.507857 -0.9189471 -0.0071408 0.0632403 0.0851825 -0.2981576 -1.4204643 -0.5235951 0.009603 -0.5345168 -0.329546 -0.0718726 -0.0029299 -0.0889208 -0.3722568 -0.9622449 -0.3195728 0.0339018 -0.1865463 -0.1181139 -0.0000578 -0.0319359 -0.0001382 -0.0224462 0.220653 0.29271 0.0496435 0.5099736 0.1959601 0.082507 0.1088285 0.0484514 0.4011516 1.6553819 0.1685637 -0.0681189 0.4302674 0.9070431 -0.0087589 -0.0284969 -0.111237 0.0622937 0.0428807 0.3097105 -0.0378871 -0.1267798 -0.0295622 -0.0517193 0.0712449 -0.0396425 -0.0780891 0.1530577 0.1148474 -0.0028329 0.240041 0.0472388 -0.031888 0.0045645 -0.0321703 -0.1113194 0.6747224 -0.615593 0.2027487 -1.1188858 0.3905056 -0.0562954 0.489203 -0.2115118 0.0634156 -0.0546438 0.0436946 0.0398528 -0.0107007 0.0050914 -0.0693184 -0.138725 -0.0522941 -0.0628699 1.2488992 0.4852755 0.0397259 0.6717003 0.2012638 0.019543 -0.0411231 0.0692393 0.0503302 -0.4306897 -0.1281535 0.0104338 0.1994299 0.0845345 -0.0573928 -0.0905914 -0.0818916 -0.165447 0.8164077 -0.2835354 -0.0731632 -0.050671 0.2233327 0.0779695 -0.2263895 0.1313832 0.3442181 0.0106384 -0.0626464 0.044987 -0.0672717 -0.0308737 0.0746408 0.0826042 0.0771728 -0.0753149 0.1445167 -0.0288927 -0.0005947 0.0211411 0.0461714 0.0305377 -0.0020628 0.0212136 0.1518251 0.0066682 0.0884393 -0.0426504 0.0947578 0.0399274 0.0266375 -0.0508087 0.0345816 0.131805 -0.0299323 -0.1353836 -0.0432798 -0.1451164 -0.0112132 -0.0483068 -0.0456995 -0.0132734 0.0670279 -0.0873068 0.1147115 0.0030574 0.1334562 0.0259906 -0.0082669 0.0137139 -0.0065307 0.0740156 0.1091178 0.0102505 0.0136559 -0.0413449 -0.0009166 0.1190892 0.029502 0.0545176 -0.0519802 0.026852 -0.0825839 0.0082288 -0.0705701 -0.0829967 0.0578684 0.0003686 0.0557202 0.1544009 0.5508448 0.1298316 -0.0199598 -0.0360401 0.1872866 0.0377658 0.0287914 0.0759486 0.312227 -0.0087262 -0.0446031 0.021153 -0.1699961 0.0111064 -0.0134395 0.0598829 -0.0407024 0.0779601 -0.0300338 0.0176392 -0.0675316 -0.0090922 0.0725065 -0.0457716 0.1010329 -0.1264307 -0.1585237 -0.0083903 0.0990374 -0.0164639 0.1511176 -0.0396429 0.0703248 -0.0380798 0.0785278 0.0598447 0.3781952 0.1488423 -0.0299009 0.125737 0.1322888 0.0596852 -0.025715 0.069861 0.3661163 unknown
polarizability: 192.1385781|4.7574159|129.6784494|3.2213064|-8.8284128|68.8400897 unknown
InChI: InChI=1S/C10H12O4/c1-6(11)10(13)7-3-4-8(12)9(5-7)14-2/h3-6,11-12H,1-2H3
charge 0 multiplicity 1
26 atoms
O  -4.456123 -0.467769 -0.796316
O  2.687577 -1.435441 0.457868
O  -2.291172 -1.844534 -0.185137
O  3.344165 1.29277 -0.20429
C  -0.673084 -0.059846 -0.319912
C  -3.277324 0.332216 -0.497696
C  -2.056275 -0.601783 -0.33281
C  0.393444 -0.938826 0.010511
C  -0.37375 1.289161 -0.654216
C  1.731345 -0.506749 0.033249
C  -3.516798 1.158849 0.792521
C  2.012763 0.860645 -0.280766
C  0.959195 1.736449 -0.637182
C  3.95071 -1.558329 -0.303708
H  -3.117346 1.013636 -1.35551
H  0.17188 -1.981575 0.256986
H  -1.166117 1.987222 -0.939016
H  -2.690586 1.86197 0.999838
H  -4.452279 1.72995 0.670354
H  -3.634696 0.48578 1.659784
H  1.190197 2.779356 -0.891566
H  -4.211513 -1.415009 -0.581779
H  4.547241 -0.634987 -0.238495
H  3.738186 -1.800335 -1.362531
H  4.478021 -2.398279 0.172363
H  3.412835 2.261359 -0.396343
