program: Gaussian 09
title: 000200454
version: EM64L-G09RevD.01
frameworkgroup: C1[X(C17H25NO2)]
method: RPBEPBE
basis: SDD
operation: Freq
keyword: #p
keyword: freq=noraman
keyword: PBEPBE/SDD
title: #p freq=noraman PBEPBE/SDD
converged: YES YES NO NO
title: Mulliken charges:
elementType: O O N C C C C C C C C C C C C C C C C C H H H H H H H H H H H H H H H H H H H H H H H H H
charge: -0.289704 -0.229942 -0.105666 0.325604 -0.544258 -0.562705 0.049415 -0.551231 0.423801 -0.756633 -0.375058 -0.644672 -0.555915 -0.442795 -0.697300 0.338383 -0.223703 -0.357371 0.260192 -0.760380 0.230235 0.210808 0.251474 0.200079 0.186246 0.206832 0.199263 0.212899 0.217260 0.228725 0.231078 0.210693 0.230950 0.185355 0.227960 0.311382 0.239282 0.219566 0.207939 0.208254 0.224137 0.303788 0.259123 0.248208 0.248399
chargesum: 0.00000
title: Mulliken charges with hydrogens summed into heavy atoms:
elementType: O O N C C C C C C C C C C C C C C C C C
charge: -0.289704 -0.229942 -0.105666 0.325604 -0.103214 -0.111153 0.235661 -0.145135 0.423801 -0.097748 0.066714 -0.000406 -0.244533 -0.203512 -0.061542 0.338383 0.000434 -0.053582 0.260192 -0.004650
polarizability: 2.45726531e+02 3.65952096e+00 2.08551083e+02 -3.52463855e+00 -1.31737862e+01 1.44735356e+02
1716.lowfreq: -60.2494 -3.6795 -0.0007 -0.0004 0.0006 5.5494 8.5298 22.4159 25.0904
frequency: -60.2464 22.1823 24.8208 41.9167 50.2583 75.3377 91.2941 97.5229 118.2487 142.6584 173.4519 199.5535 215.4778 222.4762 228.4697 259.0310 269.1944 271.3669 281.4326 301.9063 306.4669 318.9479 334.5412 358.5732 385.6474 446.6015 482.7283 484.8850 509.1750 532.9870 562.8697 565.1757 622.4896 639.2356 673.0647 714.1554 718.3588 745.2810 750.6062 776.1070 804.0276 839.7075 870.9780 891.6022 912.0600 917.4667 921.8932 942.7523 946.7194 973.1730 986.5504 988.4650 999.8144 1005.3699 1023.3543 1035.2426 1044.6539 1051.5267 1085.6271 1093.7695 1110.7161 1114.6061 1117.3611 1126.0299 1143.9392 1151.7098 1163.8400 1177.7135 1193.0796 1203.7967 1217.8046 1239.2567 1239.5892 1260.4390 1282.7836 1289.1999 1298.4376 1314.2056 1326.3418 1340.7260 1352.8318 1355.4278 1376.3717 1382.9411 1383.8681 1388.5562 1427.1522 1431.3271 1454.1936 1459.3508 1463.4545 1468.4819 1471.0106 1472.1223 1475.4441 1476.3018 1477.9142 1479.9256 1482.4282 1486.8025 1492.9095 1573.5356 1616.0132 1644.5582 2805.6344 2836.3586 2855.1647 2961.8751 2970.3362 2979.8819 2984.1296 3005.5185 3007.7311 3010.1186 3027.9764 3035.7684 3037.2687 3067.6732 3070.2416 3072.6663 3073.6800 3083.2435 3084.6480 3094.6726 3130.1957 3132.5013 3142.4851 3159.2749 3213.5437
redmass: 1.0651 6.5699 3.8999 3.3922 2.7303 3.2917 3.7085 3.3555 2.9334 2.0978 2.5419 3.8274 1.0999 1.3654 1.4040 4.5993 2.4650 2.4517 2.5248 2.9748 2.6910 2.8212 3.0671 2.7209 3.6591 2.8654 2.3841 2.8374 4.3197 3.2499 3.6249 3.3644 5.2279 5.5193 4.1426 2.2256 4.8401 2.2711 1.3731 5.2414 1.4494 1.9282 1.4079 2.1441 1.9921 1.8583 1.5178 2.1492 1.5588 2.0924 1.5357 3.4734 1.8714 2.0581 1.6280 1.9899 1.6025 2.6320 1.6820 1.7835 1.3342 1.7186 2.1186 2.3339 2.4807 2.2775 2.1240 3.6969 1.2308 2.3329 2.3072 1.5729 1.6994 1.4934 1.2545 1.3466 1.2960 1.4276 1.4012 1.4277 1.5003 1.4583 7.4672 1.2238 1.2386 1.2120 1.9500 1.4543 1.0659 1.0460 1.0553 1.2371 1.4583 1.0965 1.0501 1.0635 1.0561 1.1842 1.0614 1.0856 1.0962 6.1329 6.6916 10.9558 1.0806 1.0701 1.0582 1.0592 1.0365 1.0356 1.0625 1.0954 1.0366 1.0611 1.0725 1.0975 1.0913 1.1011 1.1031 1.0990 1.1004 1.1001 1.1001 1.0972 1.0926 1.0876 1.1010 1.0947 1.0947
irintensity: 1.4453 1.0608 1.2769 0.4220 0.0846 1.7279 1.9223 0.1621 0.6903 0.5573 1.5956 1.6181 0.6544 0.1259 0.4910 0.4780 0.1037 5.7140 1.9056 3.1224 0.1645 0.8165 0.2120 0.9175 1.2265 0.5772 3.8189 1.8672 14.7995 0.9737 1.1571 0.9975 0.0430 2.3825 4.3072 26.0649 5.5515 2.3093 12.0493 4.5117 47.9891 1.6820 2.4635 4.4373 22.3650 13.1944 3.1733 47.8340 15.3717 15.1921 1.8444 4.3355 60.6295 10.3360 18.5913 14.3506 9.0423 3.8473 8.4460 0.4084 8.3740 4.4981 10.2495 5.9240 9.9322 16.4333 74.7635 553.4673 69.9666 17.7305 10.8187 5.0076 9.4926 2.9048 5.0842 1.6960 5.9770 4.6527 11.7147 14.7854 1.2905 7.5972 12.9792 56.8451 24.2344 11.6265 18.7466 4.2357 11.2173 16.5386 9.6097 32.8502 40.1381 16.8406 8.5056 2.6750 14.1477 21.7904 2.8835 11.4743 11.5196 32.8651 38.7198 247.9828 63.9676 74.9359 219.1043 16.6945 53.4220 29.8323 26.1628 15.0475 4.8212 38.3757 34.0860 6.8384 35.7757 79.1567 27.3386 51.4771 31.0243 19.7849 53.5772 6.8334 7.6255 16.0074 7.9830 23.0804 3.7872
temp: 298.150 k
press: 1.00000 atm
elementType: 8 8 7 6 6 6 6 6 6 6 6 6 6 6 6 6 6 6 6 6 1 1 1 1 1 1 1 1 1 1 1 1 1 1 1 1 1 1 1 1 1 1 1 1 1
symmnumber: 1
zpe: 1008430.0 jmol-1
zpe.correction: 0.384091 hartree
zpe.thermalcorrener: 0.404650 hartree
zpe.thermalcorrenthalpy: 0.405594 hartree
zpe.thermalcorrgfe: 0.333678 hartree
zpe.sumelectzpe: -866.463086 hartree
zpe.sumelectthermal: -866.442527 hartree
zpe.sumelectthermalent: -866.441583 hartree
zpe.sumelectthermalfe: -866.513498 hartree
dipole: -2.7394 1.8886 -0.5926
dipole: 3.3797
quadrupole: -122.0539 -115.8693 -120.2114
quadrupole: 8.4667 -4.0477 -3.0781
quadrupole: -2.6757 3.5089 -0.8332 8.4667 -4.0477 -3.0781
hfenergy: -866.8471765 hartree
pointgroup: C01 [X(C17H25N1O2)]
dipole: 1.015274 0.7815362 0.3556114 debye
polarizability: 246.2372108|-1.6992127|205.076282|-0.2428982|18.8687511|147.699477 unknown
InChI: InChI=1S/C17H25NO2/c1-5-9-17(11-13(2)18(4)12-17)15-7-6-8-16(10-15)20-14(3)19/h6-8,10,13H,5,9,11-12H2,1-4H3
charge 0 multiplicity 1
45 atoms
O  -3.245166 0.140947 0.267838
O  -5.075955 -1.203571 -0.367061
N  1.320865 2.087707 0.860171
C  1.650083 -0.113416 -0.107861
C  1.83958 1.02588 -1.194908
C  1.681406 0.697886 1.232812
C  2.064819 2.343893 -0.409007
C  2.85004 -1.102586 -0.158623
C  0.283977 -0.800659 -0.326642
C  1.579721 3.597454 -1.151844
C  2.904904 -2.155714 0.973398
C  1.552459 3.065022 1.93686
C  -0.900669 -0.119974 0.050291
C  0.148399 -2.06464 -0.960048
C  4.129226 -3.087263 0.842505
C  -2.166265 -0.693125 -0.184253
C  -1.127402 -2.623628 -1.191715
C  -2.31057 -1.954578 -0.807919
C  -4.613668 -0.162489 0.146981
C  -5.436434 0.964837 0.735776
H  0.931666 1.119559 -1.815782
H  2.687365 0.800599 -1.866591
H  0.984276 0.303906 1.993406
H  2.715275 0.656524 1.665112
H  3.161611 2.453588 -0.187214
H  3.780327 -0.49804 -0.121806
H  2.871114 -1.618853 -1.1401
H  1.796196 4.52426 -0.589877
H  2.079823 3.679968 -2.134081
H  0.489052 3.536561 -1.318447
H  1.977105 -2.758637 0.97354
H  2.940113 -1.641218 1.954331
H  1.220045 4.068916 1.62189
H  2.629016 3.13121 2.240167
H  0.964854 2.780904 2.828057
H  -0.835441 0.874848 0.505839
H  1.034318 -2.620866 -1.280469
H  4.160682 -3.830195 1.660372
H  4.106959 -3.641386 -0.115312
H  5.073663 -2.511058 0.872415
H  -1.209025 -3.601033 -1.680625
H  -3.294862 -2.386476 -0.987035
H  -4.797207 1.766864 1.13008
H  -6.075783 0.565075 1.542135
H  -6.106689 1.369902 -0.042455
