program: Gaussian 09
title: 000200430
version: EM64L-G09RevD.01
frameworkgroup: C1[X(C18H26N2)]
method: RPBEPBE
basis: SDD
operation: Freq
keyword: #p
keyword: freq=noraman
keyword: PBEPBE/SDD
title: #p freq=noraman PBEPBE/SDD
converged: YES YES NO NO
title: Mulliken charges:
elementType: N N C C C C C C C C C C C C C C C C C C H H H H H H H H H H H H H H H H H H H H H H H H H H
charge: -0.042337 -0.042337 -0.400455 -0.400458 -0.336250 -0.336244 0.372071 0.372073 -0.337987 -0.337984 -0.138327 -0.134563 -0.134553 -0.138319 -0.297957 -0.300454 -0.300458 -0.297958 -0.669437 -0.669441 0.264592 0.260357 0.264584 0.260363 0.222900 0.224590 0.222902 0.224584 0.215491 0.216495 0.215488 0.216495 0.309337 0.311309 0.311313 0.309341 0.282817 0.282550 0.282549 0.282816 0.255985 0.219821 0.219445 0.255984 0.219823 0.219446
chargesum: 2.00000
title: Mulliken charges with hydrogens summed into heavy atoms:
elementType: N N C C C C C C C C C C C C C C C C C C
charge: -0.042337 -0.042337 0.124494 0.124489 0.111239 0.111242 0.372071 0.372073 0.093999 0.093999 0.171010 0.176745 0.176759 0.171022 -0.015140 -0.017904 -0.017909 -0.015143 0.025814 0.025812
polarizability: 4.11546205e+02 -6.10591266e-04 1.37975065e+02 6.09433374e-01 1.81608691e-02 1.74935045e+02
1716.lowfreq: -0.0004 0.0011 0.0012 3.3528 5.4414 13.4747 23.0832 26.8271 30.6301
frequency: 23.0681 26.6862 30.6200 49.0674 64.0834 70.6430 74.0770 96.5431 103.6485 113.1289 118.8712 172.1766 184.9659 229.8220 233.1971 234.4090 256.4732 314.5167 334.1832 365.1270 378.5980 388.3750 397.7638 401.9527 433.7052 456.2031 533.8824 559.2476 599.3571 653.8360 666.4237 685.9987 731.3091 742.7981 742.8135 752.4106 784.1192 796.4424 796.5493 814.4010 843.6767 864.4852 864.6068 875.3941 907.2015 908.4470 933.1783 933.2601 977.1697 980.3096 983.9875 984.2871 1004.2036 1004.5915 1023.4484 1045.1169 1046.5178 1053.6142 1053.8558 1093.8192 1097.1462 1100.4282 1101.2984 1126.5993 1133.0535 1163.7083 1165.4876 1213.3058 1214.4812 1228.4367 1240.1114 1263.1813 1263.2877 1267.5389 1267.8530 1284.6463 1284.7815 1299.9579 1308.6505 1327.9194 1328.5419 1334.1603 1334.2239 1335.4045 1363.3288 1372.6234 1404.6361 1404.6557 1438.1354 1458.6429 1459.3248 1462.6952 1470.1054 1472.0047 1474.9784 1478.7311 1478.7351 1479.1218 1485.9847 1488.9378 1501.8103 1524.8010 1538.4362 1558.0576 1633.3423 1634.1211 2977.6845 2977.7065 2987.3042 2987.3448 2990.4849 2990.4965 3024.6344 3024.6368 3033.4809 3033.4917 3050.4118 3050.4232 3087.4508 3087.4684 3097.2266 3097.2427 3105.3435 3105.3540 3178.4269 3179.7146 3181.2498 3182.5875 3198.7215 3199.3184 3203.8255 3204.6341
redmass: 3.9865 3.7841 3.4225 4.1026 3.3802 1.6440 1.6353 4.1952 3.1887 2.2953 2.4486 3.8163 4.0996 1.7828 1.1121 1.7319 4.0119 3.1164 3.8982 4.5597 2.5610 2.9524 2.7186 2.7307 3.4433 3.4879 3.3210 3.7312 3.5071 6.7226 6.7124 4.7500 3.8076 1.0699 1.0700 3.4903 5.4856 1.1591 1.1592 5.4996 1.4415 1.2587 1.2540 1.6914 1.7635 1.7630 1.2002 1.1975 1.3821 1.4253 1.4073 1.4139 3.9499 3.9584 6.8190 2.5274 2.9653 3.0287 2.9802 1.7124 1.5411 2.3050 2.3459 4.9588 3.8074 1.4713 1.5637 1.3633 1.3406 1.1741 1.1807 1.2653 1.2653 1.2196 1.2129 1.1012 1.0962 2.6858 1.6213 1.2447 1.2714 1.3886 1.3887 1.6500 2.4790 2.2825 1.1939 1.1940 2.2654 1.1865 2.3929 1.1039 1.1356 1.0673 1.1150 1.0416 1.0415 1.1034 1.1381 1.1267 1.3496 2.0925 5.4868 7.2234 5.3587 5.3332 1.0589 1.0589 1.0588 1.0588 1.0371 1.0371 1.1015 1.1015 1.0592 1.0592 1.1049 1.1049 1.1016 1.1016 1.0992 1.0992 1.1084 1.1084 1.0914 1.0927 1.0905 1.0923 1.0979 1.0979 1.1011 1.1012
irintensity: 0.3721 0.7590 0.0045 0.7577 0.0228 0.0912 0.0008 0.2616 0.1251 0.0451 0.3176 0.0094 0.2009 0.1594 0.0117 0.2205 1.9500 0.0008 0.0535 1.7095 0.0452 0.0056 0.2380 0.0129 2.7461 2.0667 47.4961 5.0995 3.6922 0.2587 0.2495 0.5446 14.0216 1.6084 14.5122 5.6891 11.5404 1.7761 0.0118 5.0896 92.6557 0.0090 0.2824 8.0930 2.2977 4.0776 1.2782 0.1465 0.0693 0.8339 1.4143 0.0046 2.6206 0.8022 2.3966 6.2411 0.0056 2.3910 3.4839 9.3398 0.0020 183.2042 4.3049 0.0178 36.9891 0.0607 1.7347 0.0230 1.1951 0.7607 0.0006 0.2447 0.4864 0.3137 1.5119 10.3278 0.3724 0.0997 0.1720 7.8549 4.5643 1.9146 1.4473 0.0304 0.6609 3.1368 1.4942 16.8952 68.4584 0.9944 5.8280 5.8076 31.6843 0.9557 0.8161 4.1215 35.0677 4.3985 46.2537 41.4747 36.4878 5.2801 33.6025 1.0658 108.1644 3.3221 0.8698 1.1027 44.7001 28.1344 8.5781 36.5672 0.0226 0.2211 1.9342 12.3028 1.4854 31.9748 17.2213 66.0437 8.3239 11.7856 1.1020 14.5675 0.0148 0.2446 0.0259 0.0080 1.7141 19.1450 2.7531 0.0393
temp: 298.150 k
press: 1.00000 atm
elementType: 7 7 6 6 6 6 6 6 6 6 6 6 6 6 6 6 6 6 6 6 1 1 1 1 1 1 1 1 1 1 1 1 1 1 1 1 1 1 1 1 1 1 1 1 1 1
symmnumber: 1
zpe: 1060470.0 jmol-1
zpe.correction: 0.403912 hartree
zpe.thermalcorrener: 0.424605 hartree
zpe.thermalcorrenthalpy: 0.425549 hartree
zpe.thermalcorrgfe: 0.351620 hartree
zpe.sumelectzpe: -808.973118 hartree
zpe.sumelectthermal: -808.952425 hartree
zpe.sumelectthermalent: -808.951481 hartree
zpe.sumelectthermalfe: -809.025410 hartree
dipole: 0.0001 -3.7575 0.0009
dipole: 3.7575
quadrupole: 67.8709 -110.5111 -91.3585
quadrupole: 0.0002 3.1590 0.0089
quadrupole: 112.5372 -65.8449 -46.6923 0.0002 3.1590 0.0089
hfenergy: -809.3770302 hartree
pointgroup: C01[X(C18H26N2)]
dipole: -0.0000173 -1.4783286 0.0011195 debye
polarizability: 411.5476405|0.0042509|137.9750654|0.1782062|0.0183614|174.9336093 unknown
InChI: InChI=1S/C18H26N2/c1-3-5-11-19-13-7-17(8-14-19)18-9-15-20(16-10-18)12-6-4-2/h7-10,13-16H,3-6,11-12H2,1-2H3
charge 2 multiplicity 1
46 atoms
N  -3.567992 -0.591011 -0.170875
N  3.567196 -0.590624 0.171873
C  -5.079524 -0.556148 -0.233719
C  5.078729 -0.555661 0.234602
C  -5.638373 0.854934 0.067527
C  5.637573 0.8550 -0.068615
C  -0.745128 -0.555085 -0.033434
C  0.744327 -0.555005 0.03442
C  -7.186826 0.854596 -0.009343
C  7.18604 0.854695 0.007922
C  -2.934365 -0.909435 1.006344
C  2.830387 -0.240967 1.278515
C  -2.831189 -0.242583 -1.277913
C  2.933569 -0.910433 -1.004978
C  -1.536422 -0.898525 1.097589
C  1.430823 -0.219335 1.234391
C  -1.431631 -0.22083 -1.233801
C  1.535629 -0.899707 -1.096218
C  -7.76886 2.255089 0.279812
C  7.768087 2.254825 -0.282951
H  -5.375427 -0.888866 -1.243961
H  -5.457775 -1.293102 0.495491
H  5.374677 -0.886984 1.245289
H  5.456948 -1.293625 -0.493603
H  -5.233291 1.585916 -0.660227
H  -5.318649 1.181615 1.076687
H  5.232669 1.586947 0.658265
H  5.317649 1.180374 -1.078137
H  -7.510227 0.519159 -1.014552
H  -7.596262 0.125832 0.717747
H  7.509653 0.520408 1.013447
H  7.595287 0.125075 -0.718416
H  -3.572356 -1.18074 1.850098
H  3.390435 0.013175 2.180972
H  -3.391247 0.010486 -2.180665
H  3.571566 -1.182688 -1.84842
H  -1.084125 -1.195632 2.047262
H  0.895472 0.085151 2.13734
H  -0.896285 0.082644 -2.137093
H  1.083334 -1.197938 -2.04554
H  -8.870427 2.23221 0.222525
H  -7.495088 2.607503 1.29086
H  -7.41233 3.001517 -0.452972
H  8.869662 2.231956 -0.225817
H  7.494175 2.606103 -1.294359
H  7.411716 3.002114 0.449033
