program: Gaussian 09
title: 000200390
version: EM64L-G09RevD.01
frameworkgroup: C1[X(C15H14N3O5)]
method: RPBEPBE
basis: SDD
operation: Freq
keyword: #p
keyword: freq=noraman
keyword: PBEPBE/SDD
title: #p freq=noraman PBEPBE/SDD
converged: YES YES NO NO
title: Mulliken charges:
elementType: O O O O O N N N C C C C C C C C C C C C C C C H H H H H H H H H H H H H H
charge: -0.304206 -0.145735 -0.245522 -0.353290 -0.243374 -0.265058 0.100342 0.119135 -0.027787 -0.543901 -0.598726 0.221612 0.112467 0.201156 0.214545 0.370609 0.253937 -0.326733 -0.332028 -0.191954 -0.190171 -0.316003 -0.495038 0.271296 0.297713 0.268341 0.313855 0.269685 0.286173 0.286416 0.264704 0.264731 0.310191 0.394872 0.253802 0.252757 0.251188
chargesum: 1.00000
title: Mulliken charges with hydrogens summed into heavy atoms:
elementType: O O O O O N N N C C C C C C C C C C C C C C C
charge: 0.090667 -0.145735 -0.245522 -0.353290 -0.243374 -0.265058 0.100342 0.119135 0.243508 0.022153 -0.015186 0.221612 0.112467 0.201156 0.214545 0.370609 0.253937 -0.040560 -0.045612 0.072749 0.074560 -0.005813 0.262710
polarizability: 2.80096965e+02 -1.39889664e+01 2.01387045e+02 1.56046965e+01 3.88420631e+01 1.44043183e+02
1716.lowfreq: -0.0010 -0.0007 -0.0007 2.9860 5.7658 7.8555 14.6505 32.4275 34.7936
frequency: 14.2645 32.4187 34.7810 36.8787 74.1926 85.3629 95.3274 102.1749 117.7754 141.2902 151.6370 154.4494 190.8639 195.0779 203.4325 229.2551 242.5149 254.3067 302.8875 320.3913 323.2413 362.3238 405.1856 441.8260 449.5163 481.8380 490.8644 511.1443 535.2308 555.2062 567.7641 574.1552 604.5070 652.3417 659.5054 675.5729 684.7603 692.5691 716.0111 730.2643 779.7002 801.3843 834.0757 846.1138 857.9342 890.8127 914.6118 916.5890 940.4690 958.9580 985.1998 1012.2507 1019.6384 1028.4138 1057.0531 1075.1061 1085.1090 1104.0206 1114.8663 1117.3815 1151.2335 1172.7971 1179.3601 1184.9398 1192.7135 1195.2294 1210.6389 1229.2806 1247.0317 1284.7744 1289.7475 1338.6238 1354.1323 1367.0963 1388.1825 1419.1357 1425.9949 1430.8557 1431.5141 1436.6860 1456.2724 1456.3974 1459.4576 1461.0061 1494.8042 1568.9073 1608.7339 1618.2073 1629.7981 1650.7761 1693.8247 2098.8327 2996.5278 3009.1227 3017.5475 3023.8611 3059.7553 3092.4202 3126.1333 3157.6172 3167.1911 3169.0338 3176.4461 3186.9138 3198.7027
redmass: 7.3673 5.6643 6.8045 6.4967 7.4358 1.0947 4.8029 8.3865 5.8781 5.0558 4.4109 5.2704 5.4698 7.2097 3.2544 5.0748 5.1584 3.9057 6.8570 7.7159 5.1034 6.6200 3.1225 4.0033 4.5155 3.6900 5.6331 3.9315 4.1212 5.8892 3.1161 5.4556 5.0462 4.6281 2.8395 3.1311 4.4626 5.1776 3.4136 4.5027 5.1677 1.5965 5.8423 6.0434 4.0177 2.2927 1.3963 3.7343 5.1874 4.2551 1.4110 2.3196 1.3794 4.0020 2.9975 3.1377 3.0174 2.3707 1.2986 2.7524 1.4286 1.7093 2.3257 1.3878 1.5811 1.4178 2.1074 1.1583 1.3109 1.2873 1.4890 1.5165 1.5993 4.9492 1.2502 1.7247 1.2269 1.3434 1.9730 1.5700 2.5586 1.0551 1.0513 3.0387 1.8739 3.1841 7.4168 7.2697 8.3846 3.1719 9.5217 13.0797 1.0675 1.0802 1.0297 1.0633 1.0976 1.0983 1.1057 1.0881 1.0915 1.1057 1.0963 1.1008 1.0920
irintensity: 0.7209 0.2224 0.7946 4.8237 0.4694 0.5372 2.2666 2.7403 4.0653 2.3348 2.3117 0.1937 1.9104 0.1476 7.1293 47.5190 8.6094 4.0225 34.2678 3.9381 4.0117 125.6389 8.4938 8.8521 4.2938 0.6316 5.6905 3.8435 5.3094 1.5493 4.0204 8.0034 17.4531 23.9009 40.1070 37.5082 153.9206 76.2128 44.4402 16.8378 10.2679 58.4987 12.6662 320.7529 217.3321 9.5754 1.9225 617.0952 5.0531 25.9251 1.5457 12.7654 0.1557 132.4281 1482.1031 6.2904 850.5525 157.3175 80.8278 1224.5653 1.2609 104.5193 152.9583 101.5012 63.7478 19.0894 150.3980 135.6590 20.1115 68.0321 28.9181 15.6439 80.0195 1142.4023 28.0871 175.5875 22.7244 19.6062 215.5818 210.2582 3.9483 19.7928 14.0241 160.7512 518.7326 52.1829 10.5273 29.5114 132.0307 457.9424 123.7457 211.0020 11.0437 1.8496 18.0390 4.9512 5.7254 1.1362 16.4828 0.6999 0.6327 7.9645 0.1189 5.2170 20.4578
temp: 298.150 k
press: 1.00000 atm
elementType: 8 8 8 8 8 7 7 7 6 6 6 6 6 6 6 6 6 6 6 6 6 6 6 1 1 1 1 1 1 1 1 1 1 1 1 1 1
symmnumber: 1
zpe: 711425.5 jmol-1
zpe.correction: 0.270968 hartree
zpe.thermalcorrener: 0.292162 hartree
zpe.thermalcorrenthalpy: 0.293106 hartree
zpe.thermalcorrgfe: 0.218252 hartree
zpe.sumelectzpe: -1118.469502 hartree
zpe.sumelectthermal: -1118.448307 hartree
zpe.sumelectthermalent: -1118.447363 hartree
zpe.sumelectthermalfe: -1118.522218 hartree
dipole: -4.2305 -0.9114 2.2514
dipole: 4.8782
quadrupole: -51.1851 -94.3327 -128.6183
quadrupole: -14.3803 -12.1642 -2.6856
quadrupole: 40.1936 -2.9540 -37.2396 -14.3803 -12.1642 -2.6856
hfenergy: -1118.7404696 hartree
pointgroup: C01 [X(C15H14N3O5)]
dipole: 1.6949231 -0.6231489 0.6498629 debye
polarizability: 222.7506662|-50.6152553|237.972194|-45.2651124|-22.633339|164.8043324 unknown
InChI: InChI=1S/C15H14N3O5/c1-21-13(19)7-9-6-10(8-17-16)22-24-23-15-12-5-3-2-4-11(12)14(20)18(9)15/h2-5,8-9H,6-7H2,1H3
charge 1 multiplicity 1
37 atoms
O  1.130102 0.579652 -1.704927
O  -1.346399 0.490899 2.299726
O  -3.384196 -2.592869 0.725091
O  2.671284 -1.205723 -1.162068
O  -2.534862 -0.97578 -0.724079
N  -0.071355 0.149149 0.290381
N  4.797532 -2.762641 -0.500595
N  5.695435 -2.81281 -1.241349
C  0.121558 -1.330199 0.286294
C  1.471602 -1.748651 0.949886
C  -1.065211 -2.092033 0.923833
C  0.325164 0.95787 -0.764941
C  -0.901555 0.931159 1.223646
C  -0.272036 2.290663 -0.605002
C  -1.012167 2.281329 0.606754
C  2.643204 -1.846834 -0.022764
C  -2.383286 -1.803725 0.207198
C  -0.180166 3.437584 -1.408062
C  -1.684022 3.424456 1.058494
C  -0.870526 4.596606 -0.963108
C  -1.607112 4.59064 0.247673
C  3.741519 -2.683251 0.331732
C  -4.744593 -2.423671 0.135753
H  0.135008 -1.61247 -0.784979
H  1.731074 -1.028688 1.751121
H  1.353858 -2.725399 1.452949
H  -1.18398 -1.864734 1.995879
H  -0.865483 -3.176162 0.841204
H  0.392514 3.435852 -2.340034
H  -2.247596 3.417063 1.996218
H  -0.833344 5.510582 -1.56368
H  -2.125934 5.501167 0.563137
H  3.79409 -3.27584 1.245659
H  1.84873 -0.363977 -1.484539
H  -5.366124 -3.157207 0.664962
H  -4.712945 -2.628231 -0.946458
H  -5.100981 -1.395975 0.3115
