program: Gaussian 09
title: 000200400
version: EM64L-G09RevD.01
frameworkgroup: C1[X(C20H24ClFN2O)]
method: RPBEPBE
basis: SDD
operation: Freq
keyword: #p
keyword: freq=noraman
keyword: PBEPBE/SDD
title: #p freq=noraman PBEPBE/SDD
converged: YES YES NO NO
title: Mulliken charges:
elementType: Cl F O N N C C C C C C C C C C C C C C C C C C C C H H H H H H H H H H H H H H H H H H H H H H H H
charge: -0.078430 -0.212185 -0.266208 -0.072997 -0.173459 -0.362536 -0.361425 -0.411388 -0.386403 -0.343211 -0.392788 0.484046 -0.395480 -0.314936 -0.361113 -0.366920 -0.221040 -0.221953 -0.118528 0.361147 -0.308036 -0.343539 -0.368287 -0.339686 0.311201 0.206885 0.187170 0.186951 0.211709 0.212514 0.216313 0.205023 0.219525 0.209758 0.178203 0.213659 0.196271 0.213607 0.215702 0.205012 0.209332 0.238298 0.223064 0.248087 0.248738 0.253561 0.256367 0.252242 0.256168
chargesum: 0.00000
title: Mulliken charges with hydrogens summed into heavy atoms:
elementType: Cl F O N N C C C C C C C C C C C C C C C C C C C C
charge: -0.078430 -0.212185 -0.266208 -0.072997 -0.173459 0.031519 0.037234 0.017439 0.038145 0.044749 0.017142 0.484046 0.033829 0.099409 -0.122815 -0.143857 0.027047 0.026785 -0.118528 0.361147 -0.054475 -0.087172 -0.116045 -0.083519 0.311201
polarizability: 3.96266206e+02 9.29062297e+00 2.24734628e+02 -8.49126156e-01 -6.73390281e+00 1.33250190e+02
1716.lowfreq: -11.7305 -0.0003 0.0009 0.0014 1.6496 4.5435 12.7464 13.9225 20.4663
frequency: 12.7161 13.1765 19.8902 29.0626 47.4018 55.3140 66.9513 77.4164 97.3334 106.5725 123.8214 140.5720 148.2341 166.7458 180.7290 225.9522 243.4016 249.1297 258.9010 301.6142 324.1490 342.7574 354.8962 361.6741 385.7173 407.1854 412.7437 418.7392 439.5251 447.9082 470.9943 496.5534 506.8058 512.2350 523.8977 572.8590 626.2469 627.1356 644.2841 695.7524 703.2917 724.7014 732.6150 751.0435 773.8355 793.2025 799.1316 808.4486 813.4999 818.7629 826.6944 844.5428 914.6507 917.4797 926.2092 930.1249 943.0433 944.4527 955.4808 972.6682 983.2846 996.5959 1000.4759 1048.0323 1050.2621 1056.5635 1066.1567 1080.8704 1086.9942 1100.8393 1103.7673 1118.3733 1124.5274 1139.3225 1152.6584 1153.4199 1168.9647 1181.5858 1196.6736 1199.2881 1211.5204 1227.7810 1238.5004 1251.6912 1260.1954 1277.7983 1285.2049 1288.0090 1293.5685 1301.0812 1306.1964 1330.8915 1343.7072 1344.4629 1359.3415 1366.3090 1371.9594 1373.8991 1378.6687 1389.1296 1397.7843 1414.0921 1415.3637 1453.0459 1457.3667 1460.5003 1466.2890 1468.3424 1470.6865 1479.0654 1487.2691 1491.4970 1495.9891 1572.0747 1598.2889 1610.2742 1618.9885 2836.2653 2847.3221 2862.4309 2911.4136 2925.0167 2943.9275 2976.0087 2993.3911 3001.0662 3007.1081 3032.4439 3034.9100 3050.0484 3054.2088 3065.1121 3088.4974 3148.3154 3154.4705 3159.8198 3161.7231 3169.3943 3176.4595 3178.5602 3182.9192
redmass: 3.9265 5.5942 5.1789 6.5471 4.9944 3.9575 4.7379 2.0049 3.4622 6.0443 6.3796 3.9446 2.3504 7.1086 3.5720 2.7718 3.2312 6.5492 2.7041 3.1527 4.1269 4.8926 7.4744 5.7653 2.5245 3.1206 3.0153 3.0729 4.5543 5.3640 2.9359 3.4014 2.4730 2.9016 5.6682 3.5874 6.9488 7.0283 2.6751 3.1594 3.6715 6.6327 4.7508 1.0880 3.0639 1.2579 1.3393 1.7254 1.2266 6.2401 1.5924 1.5567 2.0230 1.7475 1.4181 1.3389 1.3623 1.3338 2.2498 4.7025 4.0840 2.6955 2.9357 2.4667 3.0062 2.2660 2.1288 2.6806 2.1491 2.5606 1.2929 1.5236 1.8822 2.5088 1.3576 2.3048 1.6603 2.1448 1.1630 1.3270 1.6332 6.0944 1.4488 1.3060 1.2986 1.3061 1.0926 1.2820 1.2377 1.2982 1.3152 1.3704 1.5417 1.3750 1.8964 1.7506 2.8193 2.0279 1.7355 1.9658 1.4513 3.7153 3.8318 1.0804 1.0952 1.0908 1.0943 1.0785 1.1202 1.2397 1.3382 2.4878 1.4934 7.3137 7.5749 6.2554 6.8026 1.0707 1.0711 1.0695 1.0688 1.0707 1.0549 1.0603 1.0602 1.1058 1.0855 1.0982 1.0926 1.0905 1.0892 1.1048 1.0896 1.0871 1.0878 1.0877 1.0885 1.0961 1.0959 1.0968 1.0977
irintensity: 0.7770 0.4592 0.1411 0.0722 0.3365 1.1366 0.1544 0.4871 0.2849 0.1072 0.1799 0.8377 0.8831 5.7353 8.2301 0.9928 3.2389 2.7431 1.4844 5.5546 7.6895 6.1792 0.1975 0.8686 1.7168 0.7546 1.0602 0.0382 11.2561 3.1974 1.6486 9.1113 20.7596 17.5145 2.6152 0.9392 0.3541 0.0570 39.4004 3.0569 0.1508 67.8242 9.6749 8.0677 10.1269 8.9003 3.5847 75.0948 0.1929 0.5862 93.6752 2.7733 11.0921 11.1658 1.9616 3.7913 1.8252 0.2160 32.7880 85.3707 21.7348 8.9646 12.3121 22.1661 6.9078 17.0400 2.1937 19.1398 5.9316 2.1631 18.3510 10.8826 20.5000 78.4402 14.2451 21.4086 19.2593 239.8722 5.2025 1.3501 2.9987 129.1521 186.2355 26.7504 15.9976 13.7686 5.1713 1.5480 12.4760 3.6653 23.5938 1.2420 0.9046 15.6810 10.5011 5.8670 2.8116 3.1861 69.1380 30.7951 4.8583 0.6718 1.3072 1.5664 23.7948 38.7044 27.1674 0.6018 35.2469 82.2802 145.3061 256.4437 68.2769 2.4845 9.7243 88.8391 6.5523 50.7564 55.7610 146.6133 60.5471 92.9250 31.0261 13.1780 28.8458 25.6365 24.8382 3.8017 50.5330 42.4981 23.5219 87.7243 21.0783 11.0557 8.5856 13.7018 1.8686 15.1665 5.5893 7.0300 0.5240
temp: 298.150 k
press: 1.00000 atm
elementType: 17 9 8 7 7 6 6 6 6 6 6 6 6 6 6 6 6 6 6 6 6 6 6 6 6 1 1 1 1 1 1 1 1 1 1 1 1 1 1 1 1 1 1 1 1 1 1 1 1
symmnumber: 1
zpe: 1050065.2 jmol-1
zpe.correction: 0.399949 hartree
zpe.thermalcorrener: 0.423958 hartree
zpe.thermalcorrenthalpy: 0.424902 hartree
zpe.thermalcorrgfe: 0.341486 hartree
zpe.sumelectzpe: -1519.262084 hartree
zpe.sumelectthermal: -1519.238075 hartree
zpe.sumelectthermalent: -1519.237130 hartree
zpe.sumelectthermalfe: -1519.320547 hartree
dipole: 0.9889 1.3275 0.0841
dipole: 1.6574
quadrupole: -243.7902 -143.2792 -160.4565
quadrupole: -1.9993 -2.3346 -0.2297
quadrupole: -61.2816 39.2294 22.0521 -1.9993 -2.3346 -0.2297
hfenergy: -1519.6620329 hartree
pointgroup: C01 [X(C20H24Cl1F1N2O1)]
dipole: -0.3830624 -0.5201883 0.0888149 debye
polarizability: 396.0158687|11.3927729|225.3561907|0.5671451|-3.3092441|132.8789644 unknown
InChI: InChI=1S/C20H24ClFN2O/c21-17-3-7-19(8-4-17)24-14-12-23(13-15-24)11-1-2-16-25-20-9-5-18(22)6-10-20/h3-10H,1-2,11-16H2
charge 0 multiplicity 1
49 atoms
Cl 9.970249 1.282431 -0.227391
F  -9.992584 1.572773 -0.090678
O  -4.986432 -0.951839 -0.168242
N  1.273971 -0.942168 0.315627
N  4.091106 -0.294701 0.013797
C  1.727972 0.068763 -0.668542
C  2.316277 -1.989536 0.448493
C  3.049931 0.722974 -0.22676
C  3.638981 -1.371279 0.927733
C  -0.054778 -1.520504 -0.007993
C  -1.214979 -0.517391 0.159445
C  5.455174 0.085212 -0.006816
C  -2.587548 -1.196645 -0.051158
C  -3.740919 -0.197618 0.062655
C  5.854695 1.444968 -0.192054
C  6.491716 -0.892529 0.116006
C  7.216804 1.80692 -0.266537
C  7.851773 -0.534356 0.05289
C  8.204411 0.815469 -0.141423
C  -6.198274 -0.244407 -0.130345
C  -6.309958 1.146753 0.12273
C  -7.360849 -1.02204 -0.368714
C  -7.586341 1.756587 0.136066
C  -8.632488 -0.418571 -0.356204
C  -8.717962 0.963858 -0.103219
H  0.965532 0.861625 -0.761259
H  1.872592 -0.391501 -1.680439
H  2.491268 -2.520802 -0.522164
H  1.978942 -2.734787 1.192612
H  2.865643 1.336851 0.6854
H  3.381772 1.395571 -1.036553
H  4.40187 -2.16247 0.987049
H  3.49006 -0.963147 1.953302
H  -0.221537 -2.368457 0.684891
H  -0.079094 -1.942284 -1.047465
H  -1.151277 -0.077218 1.17361
H  -1.108965 0.316686 -0.562663
H  -2.629996 -1.673196 -1.049616
H  -2.735156 -1.999518 0.696172
H  -3.645634 0.606099 -0.69803
H  -3.767206 0.267936 1.07044
H  5.109873 2.242276 -0.2559
H  6.244621 -1.951591 0.233483
H  7.498753 2.854984 -0.40509
H  8.626409 -1.302157 0.140937
H  -5.426403 1.762738 0.309633
H  -7.245867 -2.092543 -0.561101
H  -7.699367 2.827442 0.328614
H  -9.540581 -1.000361 -0.537932
