program: Gaussian 09
title: 000200349
version: EM64L-G09RevD.01
frameworkgroup: C1[X(C15H20FNO)]
method: RPBEPBE
basis: SDD
operation: Freq
keyword: #p
keyword: freq=noraman
keyword: PBEPBE/SDD
title: #p freq=noraman PBEPBE/SDD
converged: YES YES NO NO
title: Mulliken charges:
elementType: F O N C C C C C C C C C C C C C C C H H H H H H H H H H H H H H H H H H H H
charge: -0.197908 -0.226727 -0.079371 -0.370467 -0.362227 -0.393579 -0.393107 -0.398295 -0.377995 -0.186770 -0.724791 0.157722 0.311809 -0.323669 -0.321907 -0.389078 -0.371674 0.330780 0.166305 0.228140 0.197414 0.171054 0.190593 0.207024 0.204647 0.189332 0.213558 0.187671 0.233115 0.186633 0.212947 0.236013 0.226978 0.223910 0.238460 0.284213 0.258332 0.260916
chargesum: 0.00000
title: Mulliken charges with hydrogens summed into heavy atoms:
elementType: F O N C C C C C C C C C C C C C C C
charge: -0.197908 -0.226727 -0.079371 0.023978 0.006241 0.004038 0.000872 0.002934 0.041754 0.026177 -0.037890 0.157722 0.311809 -0.085209 -0.037694 -0.130746 -0.110758 0.330780
polarizability: 2.00987818e+02 -2.35296698e+01 1.46014463e+02 -7.12723062e+00 -2.09482552e+00 1.59727188e+02
1716.lowfreq: -14.4143 -3.3389 -0.0008 -0.0007 -0.0007 5.2575 12.9403 27.0882 28.3937
frequency: 11.5619 26.6923 28.0174 51.1328 90.8348 102.1831 128.9451 142.1780 204.1113 220.5450 235.0246 258.7480 274.3288 297.2199 323.3852 344.6484 370.0417 375.2821 400.1931 411.0263 450.5774 462.7259 476.5261 504.3364 564.2256 579.4657 624.7263 674.3855 688.9734 748.7673 758.2665 797.8026 803.0598 819.7759 848.7190 852.1603 853.4818 879.4447 908.9973 939.8169 953.5343 958.2937 964.8748 989.9382 996.2834 1004.6104 1041.5130 1048.5343 1056.2196 1082.4032 1103.9634 1107.3768 1121.4068 1138.6982 1147.4177 1156.7644 1159.2482 1191.4575 1202.8255 1229.3630 1255.7480 1262.5295 1268.3362 1286.9721 1291.2052 1297.2418 1329.0381 1337.0521 1339.5725 1347.8398 1349.4500 1369.2839 1377.9079 1382.0130 1388.7877 1408.8109 1449.2811 1455.3759 1458.7029 1466.9701 1468.2425 1471.7127 1478.8676 1482.9867 1489.8889 1568.2436 1599.4136 1611.2802 2812.2127 2824.2950 2874.4482 2965.0370 2980.1397 2983.4343 2986.7877 3014.2049 3017.0884 3031.8108 3037.7302 3045.4997 3048.3207 3054.8856 3078.2821 3082.6254 3154.2940 3157.9852 3176.8403 3180.0320
redmass: 5.0730 3.2332 3.8514 4.7245 3.0152 9.1527 4.0406 3.9338 1.1709 2.3666 1.9176 2.6148 5.0944 5.4062 4.6266 2.3542 2.4944 2.8711 3.3971 3.0102 2.8207 2.6808 4.1977 3.0647 1.9691 5.2937 7.1260 4.1311 3.1725 3.7916 3.4644 6.0787 1.4800 1.2945 2.6180 1.5755 1.4491 2.0706 2.2112 1.5823 1.3917 1.3323 3.1053 1.3605 2.5027 2.5215 2.1402 1.8695 2.7466 1.4154 1.5302 1.8034 2.4440 1.8607 1.3445 1.4992 2.1517 1.5162 2.3542 2.6701 1.3256 1.2771 1.2577 1.3939 1.3033 1.5157 1.2803 1.4414 1.4418 1.5343 1.4975 1.5661 1.6560 2.3291 1.3053 3.9920 1.0909 1.0865 1.0885 1.0905 1.0830 1.0522 1.0964 1.0954 2.4264 8.4985 7.1951 7.2070 1.0715 1.0701 1.0709 1.0627 1.0346 1.0617 1.0612 1.0856 1.0827 1.0948 1.0901 1.1033 1.0892 1.1035 1.1000 1.1001 1.0883 1.0888 1.0964 1.0974
irintensity: 0.2316 0.0814 0.2381 1.0851 0.3496 3.6756 0.7866 0.3637 0.1769 0.3258 1.1817 0.9927 1.2599 1.7765 3.7845 9.1282 1.3647 2.1376 14.1272 1.2556 0.2925 0.4130 10.4720 20.1944 1.6182 19.5217 0.7168 7.8871 6.0593 23.1787 7.6825 12.3003 0.0447 6.8006 3.1433 44.2543 26.7708 1.0675 0.7837 3.6474 1.3869 4.0079 73.1739 2.2815 32.3895 2.4131 5.8753 11.8408 11.2690 3.6203 22.5423 20.5549 5.1122 20.8389 4.6602 71.7035 19.1911 12.0612 29.0162 162.9453 9.4470 19.2711 19.2930 1.7519 4.2944 19.9364 3.2778 10.6680 1.3774 8.0460 7.5900 4.0956 13.5070 18.4941 15.7813 16.4374 7.9799 7.6237 14.2884 8.9856 6.9231 17.4538 6.2076 31.4748 18.5478 116.2263 69.7950 50.1550 56.7311 161.5685 139.9487 41.3985 33.5554 27.4822 32.8106 48.4010 26.5968 62.5649 15.0707 25.6274 16.5083 100.9490 40.2298 26.8535 7.9762 0.0301 4.5161 4.4598
temp: 298.150 k
press: 1.00000 atm
elementType: 9 8 7 6 6 6 6 6 6 6 6 6 6 6 6 6 6 6 1 1 1 1 1 1 1 1 1 1 1 1 1 1 1 1 1 1 1 1
symmnumber: 1
zpe: 837300.8 jmol-1
zpe.correction: 0.318911 hartree
zpe.thermalcorrener: 0.336334 hartree
zpe.thermalcorrenthalpy: 0.337278 hartree
zpe.thermalcorrgfe: 0.270923 hartree
zpe.sumelectzpe: -812.037841 hartree
zpe.sumelectthermal: -812.020419 hartree
zpe.sumelectthermalent: -812.019475 hartree
zpe.sumelectthermalfe: -812.085829 hartree
dipole: -1.1990 0.5272 -2.3747
dipole: 2.7119
quadrupole: -111.4658 -108.7757 -104.2710
quadrupole: 2.6397 1.7684 -5.4028
quadrupole: -3.2950 -0.6049 3.8999 2.6397 1.7684 -5.4028
hfenergy: -812.3567525 hartree
pointgroup: C01 [X(C15H20F1N1O1)]
dipole: -0.7218457 -0.7056861 0.3454776 debye
polarizability: 187.6409669|7.6793841|151.7591961|31.2612229|-8.2221165|167.3293053 unknown
InChI: InChI=1S/C15H20FNO/c1-12(11-17-9-3-2-4-10-17)15(18)13-5-7-14(16)8-6-13/h5-8,12H,2-4,9-11H2,1H3
charge 0 multiplicity 1
38 atoms
F  4.583401 0.223102 3.179341
O  0.659749 0.289924 -1.879501
N  -2.438433 0.232209 -0.646996
C  -3.049835 1.256809 -1.530275
C  -3.360135 -0.189603 0.434536
C  -3.467391 2.501275 -0.72054
C  -3.789917 1.01061 1.303211
C  -4.42768 2.114007 0.427612
C  -1.850962 -0.909988 -1.386596
C  -0.575659 -1.442429 -0.692489
C  -0.105682 -2.785077 -1.322596
C  0.557784 -0.408169 -0.826829
C  1.589868 -0.274044 0.260885
C  1.610899 -1.096351 1.420317
C  2.599153 0.717186 0.102674
C  2.612676 -0.939521 2.401041
C  3.602502 0.895399 1.072132
C  3.584124 0.056945 2.202888
H  -3.951195 0.851639 -2.063962
H  -2.303312 1.534221 -2.296197
H  -2.851243 -0.945861 1.062367
H  -4.277521 -0.681502 0.010052
H  -3.943638 3.237271 -1.396787
H  -2.557131 2.970217 -0.299565
H  -2.896664 1.416462 1.816263
H  -4.499875 0.667726 2.080804
H  -4.677325 3.000208 1.041359
H  -5.380424 1.737767 -0.000604
H  -1.564346 -0.567579 -2.397336
H  -2.578752 -1.750111 -1.509743
H  -0.802475 -1.609472 0.37647
H  0.102531 -2.651017 -2.399583
H  0.814169 -3.167055 -0.844105
H  -0.892914 -3.553456 -1.215746
H  0.850177 -1.868308 1.569571
H  2.570493 1.337129 -0.798916
H  2.646036 -1.564811 3.297627
H  4.381446 1.655953 0.967319
