program: Gaussian 09
title: 000200357
version: EM64L-G09RevD.01
frameworkgroup: C1[X(C17H22FN3)]
method: RPBEPBE
basis: SDD
operation: Freq
keyword: #p
keyword: freq=noraman
keyword: PBEPBE/SDD
title: #p freq=noraman PBEPBE/SDD
converged: YES YES NO NO
title: Mulliken charges:
elementType: F N N N C C C C C C C C C C C C C C C C C H H H H H H H H H H H H H H H H H H H H H H
charge: -0.213141 -0.150820 -0.080933 -0.081537 -0.192829 -0.448755 -0.358596 0.549047 -0.745660 0.245873 -0.342607 -0.386200 -0.332778 -0.616225 -0.618222 -0.386359 -0.388295 0.317105 -0.191743 -0.359071 -0.214545 0.208804 0.224524 0.241776 0.215488 0.214602 0.272030 0.217754 0.208278 0.242982 0.243069 0.234903 0.223991 0.191478 0.227922 0.219557 0.192096 0.228598 0.249925 0.249052 0.228918 0.232907 0.227638
chargesum: 0.00000
title: Mulliken charges with hydrogens summed into heavy atoms:
elementType: F N N N C C C C C C C C C C C C C C C C C
charge: -0.213141 -0.150820 -0.080933 -0.081537 0.015975 0.017546 0.071495 0.549047 -0.047600 0.245873 -0.099626 -0.143131 -0.097875 0.027167 0.022028 -0.136434 -0.139243 0.317105 0.037175 -0.126164 0.013094
polarizability: 2.40617735e+02 5.69047247e+00 2.00653274e+02 1.27472243e+01 -6.83573713e+00 1.69177218e+02
1716.lowfreq: -5.8517 -0.0006 -0.0004 -0.0002 6.0769 7.0642 20.4807 26.6126 35.3287
frequency: 19.6145 26.5408 35.2016 37.8984 48.3022 73.1788 100.0695 107.1846 141.5292 158.8880 177.7458 214.3194 222.4466 233.4096 239.7319 280.1146 287.1198 319.1084 333.6859 347.8929 355.9078 392.7384 411.2053 411.9381 417.3424 432.6506 468.6121 481.6488 521.1492 538.3322 547.9394 613.1036 628.6037 630.3410 684.8122 730.5291 734.9228 754.7890 770.9523 781.9802 810.2742 815.1086 826.7913 836.0167 847.7737 907.3905 942.0151 944.5547 949.3545 958.5994 975.6682 1003.9796 1011.7823 1021.7981 1033.4719 1039.8286 1050.1444 1060.7224 1072.7134 1089.0655 1091.2172 1102.3410 1120.4656 1140.3949 1154.9167 1161.5201 1173.0122 1197.9441 1199.4832 1212.3515 1253.4794 1265.2067 1286.7725 1292.5972 1297.1462 1307.3618 1322.2836 1322.5714 1333.7044 1374.1914 1375.7071 1378.6680 1398.8105 1404.1800 1420.5401 1423.2949 1442.7772 1463.1997 1466.9330 1468.7862 1473.4999 1477.2636 1482.9493 1485.6673 1493.6025 1495.0018 1499.8697 1549.7385 1594.6520 1604.2644 1612.8613 2852.7909 2858.2264 2874.4968 2967.1710 2990.9821 2998.6443 3020.3204 3026.4759 3028.7087 3064.4972 3078.2508 3078.9611 3082.9048 3117.1478 3119.2544 3133.2005 3138.2406 3156.9901 3163.8224 3170.9221 3175.7225 3177.7134
redmass: 4.6453 3.9512 3.9408 4.3967 3.2213 3.8550 3.3494 3.4659 4.7880 3.6903 3.3390 2.7054 3.3940 1.1265 1.3292 1.2855 3.9998 2.4966 3.4250 3.2400 3.4148 4.1346 2.8638 2.8829 3.3719 2.4400 3.6971 3.2310 3.7903 3.2214 3.6315 6.8502 6.3432 5.0408 3.6091 1.6973 3.0420 4.0247 2.6915 1.2373 4.1077 1.2897 2.7622 1.9633 1.3689 2.3322 1.3333 1.4148 6.0118 1.3628 1.3167 2.9805 3.0490 1.8823 1.5720 2.4655 2.3772 1.7004 2.4907 1.6204 1.3675 1.8078 1.4548 1.5542 1.5935 2.1242 1.1323 1.9869 1.9526 3.1552 1.7386 2.4159 1.5514 1.5170 1.2375 1.4184 1.5283 1.4030 3.9140 1.3196 2.6603 1.6877 1.7601 3.2511 1.2375 1.7101 1.1535 1.0509 1.0760 1.2970 1.1176 1.0537 1.3498 1.0738 1.1258 2.2824 1.3513 5.3329 5.9742 7.7396 6.4154 1.0570 1.0630 1.0632 1.0815 1.0373 1.0625 1.0733 1.0784 1.0811 1.1021 1.1006 1.0988 1.1005 1.0998 1.0892 1.0886 1.0886 1.0877 1.0927 1.0957 1.1002 1.0968
irintensity: 0.0951 0.0890 0.2352 0.3630 0.2535 0.9227 0.3664 1.3281 3.7113 0.1990 1.5433 0.3370 0.3519 0.0483 1.7620 0.5522 1.6339 2.7297 5.8363 1.9982 3.9287 3.1946 0.6529 1.5908 1.6512 0.4606 23.3261 10.1942 15.9176 5.0805 4.2221 2.4704 0.8579 2.1535 5.7330 24.9932 6.5497 13.2091 56.8970 10.2957 18.6214 0.8114 41.8375 53.1045 0.4353 1.7994 0.1185 0.5059 9.1385 0.4971 0.0617 14.4455 16.5217 8.7399 24.0694 6.4815 31.5249 43.9072 10.9915 3.2907 5.5949 34.3602 15.1194 2.1439 51.9471 12.4400 3.8576 42.0503 5.4827 42.3658 12.8759 11.0689 17.3333 10.9779 10.5367 9.3291 66.8649 12.7279 10.4695 4.9827 4.4482 29.5720 12.7117 4.5552 10.8517 17.1246 0.9567 7.5675 6.3842 115.9645 21.4149 23.1592 34.0306 16.0698 22.7917 109.3251 84.6220 35.0657 266.0983 9.4689 10.2324 64.1476 97.4831 164.6962 18.7517 34.3467 28.0287 44.1977 54.0902 10.2385 32.0210 40.4450 31.2779 63.0516 12.7779 21.5756 10.1297 11.6319 6.5237 33.9902 8.0294 16.7962 4.4775
temp: 298.150 k
press: 1.00000 atm
elementType: 9 7 7 7 6 6 6 6 6 6 6 6 6 6 6 6 6 6 6 6 6 1 1 1 1 1 1 1 1 1 1 1 1 1 1 1 1 1 1 1 1 1 1
symmnumber: 1
zpe: 937915.4 jmol-1
zpe.correction: 0.357233 hartree
zpe.thermalcorrener: 0.377929 hartree
zpe.thermalcorrenthalpy: 0.378873 hartree
zpe.thermalcorrgfe: 0.305680 hartree
zpe.sumelectzpe: -923.506703 hartree
zpe.sumelectthermal: -923.486008 hartree
zpe.sumelectthermalent: -923.485063 hartree
zpe.sumelectthermalfe: -923.558256 hartree
dipole: -4.8875 -0.0670 0.6320
dipole: 4.9287
quadrupole: -130.3566 -122.3457 -121.1210
quadrupole: 2.8805 8.6874 -4.7755
quadrupole: -5.7488 2.2620 3.4868 2.8805 8.6874 -4.7755
hfenergy: -923.8639362 hartree
pointgroup: C01 [X(C17H22F1N3)]
dipole: 1.930251 0.151218 -0.1064195 debye
polarizability: 239.1701291|-2.6313928|199.843366|17.1921107|8.00588|171.4347321 unknown
InChI: InChI=1S/C17H22FN3/c1-14(15-7-9-16(18)10-8-15)21(13-12-20(2)3)17-6-4-5-11-19-17/h4-11,14H,12-13H2,1-3H3
charge 0 multiplicity 1
43 atoms
F  -5.482006 -1.630425 0.882389
N  0.763487 -0.156753 -0.06673
N  4.34451 -1.216872 0.774475
N  -0.581815 1.650323 -0.766894
C  -0.036787 -1.077787 -0.931116
C  1.884318 -0.730102 0.701619
C  3.242413 -0.669278 -0.048211
C  -1.507413 -1.165183 -0.47789
C  0.160556 -0.804186 -2.440093
C  0.496331 1.213152 -0.031914
C  -1.799541 -1.233959 0.909171
C  -2.580267 -1.263801 -1.396788
C  1.289614 2.131503 0.734319
C  5.464018 -1.741199 -0.035532
C  4.814969 -0.276891 1.813034
C  -3.12102 -1.386258 1.3775
C  -3.91329 -1.418163 -0.953514
C  -4.152476 -1.476622 0.427764
C  0.921406 3.487765 0.761709
C  -0.909113 2.969583 -0.724766
C  -0.205284 3.934083 0.027255
H  0.406424 -2.07576 -0.730624
H  1.961626 -0.221452 1.680614
H  1.664474 -1.789389 0.922158
H  3.157302 -1.281994 -0.965095
H  3.439516 0.381506 -0.379826
H  -0.317229 0.14549 -2.726027
H  1.239319 -0.740405 -2.667821
H  -0.262137 -1.626984 -3.045349
H  -0.983598 -1.143494 1.634809
H  -2.391038 -1.198975 -2.471673
H  2.174068 1.801263 1.284491
H  6.203435 -2.226921 0.626638
H  5.997488 -0.953316 -0.625272
H  5.089181 -2.503052 -0.741625
H  3.981679 0.023899 2.471695
H  5.273065 0.651771 1.3858
H  5.572958 -0.773167 2.444717
H  -3.353184 -1.43169 2.445588
H  -4.748424 -1.4860 -1.657019
H  1.517322 4.196708 1.347637
H  -1.779528 3.255776 -1.327948
H  -0.517227 4.982052 0.027945
