program: Gaussian 09
title: 000200340
version: EM64L-G09RevD.01
frameworkgroup: C1[X(C16H29NO2)]
method: RPBEPBE
basis: SDD
operation: Freq
keyword: #p
keyword: freq=noraman
keyword: PBEPBE/SDD
title: #p freq=noraman PBEPBE/SDD
converged: NO YES NO NO
title: Mulliken charges:
elementType: O O N C C C C C C C C C C C C C C C C H H H H H H H H H H H H H H H H H H H H H H H H H H H H H
charge: -0.285248 -0.244517 -0.124422 0.084914 -0.458898 -0.493751 -0.464858 -0.463047 0.045024 -0.355053 -0.368396 -0.402840 -0.400953 -0.401458 0.244824 -0.522812 -0.344087 -0.341571 -0.692664 0.164617 0.215954 0.202620 0.220713 0.214019 0.208958 0.212363 0.236415 0.203196 0.234259 0.168769 0.202812 0.228802 0.162704 0.189638 0.205777 0.202960 0.190755 0.213959 0.188567 0.235222 0.241691 0.203272 0.217378 0.192996 0.191430 0.211508 0.212839 0.215619
chargesum: 0.00000
title: Mulliken charges with hydrogens summed into heavy atoms:
elementType: O O N C C C C C C C C C C C C C C C C
charge: -0.285248 -0.244517 -0.124422 0.249530 -0.040324 -0.059019 -0.043537 -0.023436 0.279283 0.016528 0.023110 -0.007424 -0.007237 0.001068 0.244824 -0.045899 0.076563 0.042855 -0.052698
polarizability: 2.49093298e+02 1.30925180e+00 1.62716214e+02 -6.99930528e-01 2.66532275e+00 1.44763598e+02
1716.lowfreq: -3.1713 -1.6459 -0.0011 -0.0006 0.0016 5.7272 13.6075 23.1385 34.2260
frequency: 8.1986 22.8827 34.1276 38.4996 56.2214 72.2372 83.3916 104.7105 111.4221 142.6863 177.4176 180.3822 210.2350 226.3406 235.9516 242.7034 286.5338 303.0483 311.0228 323.3694 370.2754 390.0306 410.0658 435.1709 441.1879 453.2252 467.5215 480.8955 544.2703 560.0738 612.1797 673.3620 724.4920 762.5255 788.2145 790.7310 797.0380 804.3493 853.7637 859.7901 863.8886 880.5934 901.3116 904.7238 914.7615 919.1518 933.3912 957.2979 979.0590 983.5492 1005.1767 1034.3045 1043.9851 1047.0715 1056.0281 1073.1250 1082.2260 1094.0149 1099.2743 1105.4459 1107.0347 1121.4843 1132.3438 1139.3413 1147.0306 1156.2186 1161.6832 1204.6571 1213.2160 1229.3117 1241.3617 1250.2963 1258.2543 1259.8678 1268.3494 1272.9116 1287.6944 1288.2917 1296.2754 1299.6235 1302.7515 1319.0615 1330.5086 1332.0243 1333.4604 1343.4518 1345.5726 1349.4800 1355.0404 1358.5440 1363.0965 1376.2014 1385.2747 1390.2425 1441.0440 1450.0843 1460.0536 1461.8260 1462.8291 1465.6746 1466.9556 1467.3225 1473.3481 1475.7979 1476.1404 1478.3168 1478.8111 1487.8366 1634.5531 2800.5375 2809.7411 2824.8580 2962.8065 2966.1682 2973.9745 2978.6893 2978.7244 2983.5428 2984.6683 2984.7579 2988.2641 2989.9634 2992.6022 3006.3948 3012.8235 3031.7908 3035.0971 3042.4494 3045.2866 3050.1201 3053.2707 3053.8294 3057.5170 3059.7635 3063.2143 3064.6578 3072.4914 3073.3994
redmass: 2.7026 3.6139 2.4217 3.6154 3.3223 4.0283 3.3014 3.3726 1.9238 4.2933 3.7185 3.7258 1.8712 1.1147 1.9245 2.4401 2.8239 3.1095 3.9201 4.5384 2.2540 2.2542 3.0639 2.2126 2.6521 2.2569 2.9558 2.4536 2.7394 2.8810 2.4278 5.8249 1.1098 2.9881 1.2959 1.4339 2.8883 1.4857 1.5605 2.5282 3.9530 2.3778 1.4190 1.8623 2.2713 1.2956 3.3124 1.3361 2.6807 2.1729 2.4990 3.4816 2.3454 1.7539 1.2594 1.4977 2.0620 2.3334 2.2985 1.8324 2.3583 2.4946 2.2173 2.8323 1.5567 1.9320 1.8137 1.4572 1.4236 1.5886 1.4725 1.2849 1.3622 1.2735 1.1764 1.2040 1.0681 1.2634 1.4289 1.2066 1.2295 1.2834 1.5152 1.2572 1.4631 1.5401 1.4961 1.5351 1.4904 1.5607 1.6893 1.4432 1.4381 1.2206 1.0856 1.0907 1.0875 1.0873 1.0901 1.0797 1.0697 1.0936 1.0857 1.0510 1.0568 1.0962 1.0985 1.0814 9.8848 1.0795 1.0720 1.0709 1.0591 1.0623 1.0366 1.0633 1.0638 1.0609 1.0615 1.0620 1.0602 1.0655 1.0612 1.0988 1.0828 1.0965 1.0965 1.1010 1.0959 1.0964 1.1013 1.0961 1.0985 1.1013 1.1002 1.0901 1.1008 1.0996
irintensity: 0.0106 0.0847 0.5762 0.3508 0.3671 0.2883 1.5891 0.2908 0.4035 1.5072 1.1994 3.2830 0.0387 0.0411 0.6511 2.6114 2.1078 3.9341 5.1844 7.9724 3.1643 1.7431 0.7915 4.2319 1.5451 1.3672 0.4472 0.8602 0.7311 1.3829 3.1280 3.1219 12.4365 11.8471 0.5731 0.1576 2.8322 0.0700 3.4320 8.7912 3.3734 16.7064 12.0368 16.5526 1.2112 4.0268 52.5371 2.7333 11.8768 2.8858 81.6426 45.3560 8.4860 9.7041 0.7444 14.4074 6.6758 142.7337 38.2751 18.5145 9.4092 4.7330 3.5286 286.7726 1.0777 4.5848 13.0604 2.5748 8.2118 4.2422 3.9194 3.3789 53.3094 7.5187 10.8521 8.4757 0.7051 4.1606 0.6392 2.8814 0.5039 1.4488 18.9781 2.7061 16.2473 21.4404 2.4271 0.7620 1.7082 0.9694 12.3741 11.6220 4.9428 14.7360 20.9014 6.6834 14.7752 1.9633 10.4313 0.2728 1.2390 14.3737 18.9525 8.7881 7.4629 2.6385 0.0428 19.4314 153.3660 37.9497 41.0614 205.2219 31.8654 39.2491 36.7676 28.0445 2.2875 38.4827 45.6459 8.1450 37.5884 12.5137 41.5372 11.1027 18.5914 73.9475 1.2644 27.8786 10.7565 21.3297 83.8343 79.4381 10.5915 10.6738 91.5887 9.2033 96.6147 59.0476
temp: 298.150 k
press: 1.00000 atm
elementType: 8 8 7 6 6 6 6 6 6 6 6 6 6 6 6 6 6 6 6 1 1 1 1 1 1 1 1 1 1 1 1 1 1 1 1 1 1 1 1 1 1 1 1 1 1 1 1 1
symmnumber: 1
zpe: 1122162.3 jmol-1
zpe.correction: 0.427409 hartree
zpe.thermalcorrener: 0.448041 hartree
zpe.thermalcorrenthalpy: 0.448985 hartree
zpe.thermalcorrgfe: 0.374806 hartree
zpe.sumelectzpe: -830.768641 hartree
zpe.sumelectthermal: -830.748009 hartree
zpe.sumelectthermalent: -830.747065 hartree
zpe.sumelectthermalfe: -830.821245 hartree
dipole: 0.9025 1.1145 1.7716
dipole: 2.2793
quadrupole: -110.7541 -118.2349 -119.5157
quadrupole: -4.3136 -2.1627 -3.5889
quadrupole: 5.4142 -2.0667 -3.3475 -4.3136 -2.1627 -3.5889
hfenergy: -831.1960502 hartree
pointgroup: C01 [X(C16H29N1O2)]
dipole: -0.3643398 0.1847424 -0.7983091 debye
polarizability: 249.0207172|-2.5775264|159.0850188|-1.7297871|-7.6798133|148.4673734 unknown
InChI: InChI=1S/C16H29NO2/c1-2-3-7-16(18)19-15-10-8-14(9-11-15)17-12-5-4-6-13-17/h14-15H,2-13H2,1H3
charge 0 multiplicity 1
48 atoms
O  2.139441 0.416169 -0.592686
O  3.069297 -0.854536 1.132546
N  -3.595153 -0.056727 0.07424
C  -2.179931 -0.002069 -0.421717
C  -1.512979 1.325331 0.038836
C  -1.312348 -1.190821 0.065452
C  -0.055849 1.457917 -0.463362
C  0.150364 -1.069904 -0.42871
C  0.773815 0.263032 0.015705
C  -4.476922 0.856671 -0.705258
C  -4.202101 -1.41367 0.136344
C  -5.875594 0.983704 -0.069904
C  -5.596927 -1.367808 0.797499
C  -6.543507 -0.40328 0.050744
C  3.202767 -0.211077 0.064854
C  4.498018 -0.001926 -0.70432
C  5.756884 -0.330753 0.122806
C  7.053171 -0.202146 -0.707316
C  8.318648 -0.52325 0.116739
H  -2.165826 -0.026956 -1.546366
H  -1.543505 1.347575 1.146189
H  -2.091664 2.198641 -0.311502
H  -1.7171 -2.151472 -0.300131
H  -1.336496 -1.224147 1.173863
H  -0.032695 1.488833 -1.570582
H  0.392966 2.400623 -0.099977
H  0.749207 -1.913037 -0.040016
H  0.177005 -1.118541 -1.535769
H  0.894811 0.271544 1.116512
H  -4.588052 0.487928 -1.761361
H  -4.007636 1.85374 -0.75942
H  -3.552676 -2.075173 0.732182
H  -4.298111 -1.866689 -0.88781
H  -6.495649 1.666864 -0.682379
H  -5.770528 1.434513 0.935845
H  -5.47707 -1.028103 1.844755
H  -6.019298 -2.391238 0.822939
H  -7.51568 -0.327451 0.573707
H  -6.751083 -0.801282 -0.9645
H  4.456072 -0.647072 -1.606299
H  4.519477 1.037685 -1.080994
H  5.808111 0.342897 1.000633
H  5.668583 -1.355872 0.529655
H  7.129794 0.825568 -1.118019
H  6.998493 -0.883222 -1.581628
H  8.413977 0.162666 0.979449
H  8.281399 -1.555356 0.513088
H  9.234877 -0.427827 -0.49436
