program: Gaussian 09
title: 000200384
version: EM64L-G09RevD.01
frameworkgroup: C1[X(C21H25N2O)]
method: RPBEPBE
basis: SDD
operation: Freq
keyword: #p
keyword: freq=noraman
keyword: PBEPBE/SDD
title: #p freq=noraman PBEPBE/SDD
converged: YES YES NO NO
title: Mulliken charges:
elementType: O N N C C C C C C C C C C C C C C C C C C C C C H H H H H H H H H H H H H H H H H H H H H H H H H
charge: -0.221946 -0.091186 -0.446631 -0.184038 0.059450 -0.439731 -0.532966 -0.566415 -0.412618 -0.609452 0.170048 -0.326517 0.217759 0.562828 0.305333 0.219981 -0.699521 -0.397456 -0.391463 -0.241273 -0.363186 -0.251281 -0.197207 -0.753101 0.309933 0.277622 0.291419 0.293899 0.292828 0.240291 0.288587 0.312057 0.271725 0.268852 0.265402 0.252883 0.321552 0.266425 0.247681 0.256036 0.219178 0.226677 0.154552 0.259609 0.246331 0.251203 0.246807 0.291049 0.237991
chargesum: 1.00000
title: Mulliken charges with hydrogens summed into heavy atoms:
elementType: O N N C C C C C C C C C C C C C C C C C C C C C
charge: -0.221946 -0.091186 -0.125079 0.125895 0.059450 0.129310 0.053761 -0.037536 -0.100560 -0.068876 0.170048 0.191768 0.217759 0.562828 0.305333 0.219981 0.070620 -0.178278 -0.164786 -0.086720 -0.103577 -0.004950 0.053996 0.022746
polarizability: 3.17418677e+02 -2.90496729e+01 2.55608585e+02 -7.22355370e-01 -2.86893110e+00 1.53664177e+02
1716.lowfreq: -13.9466 -7.0623 -0.0006 0.0003 0.0007 11.0970 52.1042 66.2946 83.0349
frequency: 52.0678 66.2776 82.9933 93.1500 97.0504 118.6823 131.4539 159.8037 163.9977 182.1993 210.3580 220.1606 237.4229 243.5965 261.5166 264.3115 291.8269 316.7898 326.0126 343.1890 369.9364 386.8221 391.9933 422.9439 449.8047 463.8903 491.6660 504.9506 522.8949 541.7865 557.9568 568.8664 584.8796 608.7395 611.2349 634.9649 651.2639 680.8519 702.1679 710.0035 753.3417 760.7381 780.7931 792.6906 800.9733 805.2692 840.1651 856.2367 859.4057 863.1940 881.4411 914.2491 919.0923 938.0137 942.1618 946.2358 958.9889 975.4082 990.5133 990.5741 1019.2685 1019.5511 1027.3733 1039.9299 1046.8546 1047.9414 1064.3380 1090.0631 1105.2226 1109.2410 1111.8922 1137.6188 1149.5308 1164.3028 1172.0911 1177.5169 1188.2670 1200.3388 1213.4551 1228.8915 1245.5167 1250.9061 1260.0998 1266.3547 1288.6220 1293.7218 1308.2753 1309.9687 1320.9961 1334.9748 1345.8585 1349.9335 1351.5922 1356.1125 1372.8601 1380.9358 1384.2593 1406.6804 1415.2078 1416.1597 1451.8780 1458.6526 1463.7947 1467.8677 1469.8869 1472.4779 1473.1788 1478.0117 1483.3802 1484.6087 1490.9177 1565.6071 1608.0973 1624.7726 1643.1086 1672.6840 2856.9093 2973.5171 2998.8369 3001.6697 3007.0425 3015.3486 3016.4803 3030.1816 3047.2930 3047.8675 3053.2993 3065.2354 3076.4938 3077.1918 3091.6218 3098.9642 3109.6840 3110.2738 3114.2172 3114.7821 3122.7303 3148.5161 3161.0350 3178.4636 3581.3982
redmass: 4.1320 4.9603 3.2898 3.3555 3.4198 2.2278 2.4003 3.7978 2.3411 3.2092 1.8899 1.6102 2.5300 2.3708 2.9984 2.8064 3.9150 2.8091 3.5381 4.4407 3.4021 3.4603 3.4751 2.0479 2.9625 3.1198 3.7267 3.1850 3.6396 3.5769 2.6371 3.4857 1.6924 3.6284 4.5402 3.8801 4.7581 4.4847 4.3755 4.0835 3.5714 1.3552 3.0223 1.5390 2.6133 2.1673 2.4588 2.5743 1.8239 1.3985 2.6131 2.8474 2.2258 1.4378 2.2345 1.9038 2.4104 2.3920 1.3556 2.7408 2.0361 2.2726 1.9790 2.5191 1.9584 1.8481 2.1971 2.6375 2.2388 2.3525 2.1189 2.1727 1.6269 1.7197 1.5432 1.1313 2.2254 2.5231 1.4851 1.7475 1.7909 1.7209 1.5094 1.5562 1.3719 1.3202 1.4213 1.3652 1.3295 1.4703 1.3593 1.8994 1.4437 1.8974 1.3865 1.3252 1.8954 1.1981 1.2058 3.4312 1.0925 2.8750 1.1355 1.0730 1.0761 1.4839 1.4512 1.0540 1.0661 1.0600 1.0830 6.5717 6.8109 6.6505 8.1079 6.9386 1.0834 1.0405 1.0657 1.0800 1.0374 1.0637 1.0627 1.0627 1.0693 1.0844 1.0877 1.0899 1.1004 1.1044 1.1007 1.0985 1.0996 1.1037 1.0906 1.1020 1.1064 1.0884 1.0936 1.1000 1.0795
irintensity: 0.6426 1.9387 0.1606 0.2141 0.2555 1.5596 5.9716 6.2362 4.2049 1.4114 1.8886 3.1689 0.2760 4.4850 3.0568 2.0267 0.5518 1.6310 2.0976 5.6669 3.6258 1.6275 2.4155 1.7575 8.7556 2.3227 3.0715 4.0420 3.8667 4.7451 13.2822 6.3031 59.5954 17.0315 10.7408 2.2538 8.0657 1.6663 5.1020 5.4167 7.8426 90.6945 7.2499 3.8195 12.2772 44.6119 6.9173 7.8145 6.9192 7.2600 5.1839 8.8741 17.3673 0.3117 27.5737 1.3457 6.4997 9.8575 0.7755 17.0201 5.7662 12.0708 24.7185 19.7950 6.7425 9.0042 18.3653 1.4903 7.8919 2.8813 13.4603 8.8839 7.5676 52.3314 11.6105 1.9426 2.7537 89.5818 19.7772 36.1090 6.5473 7.6593 21.7782 10.9069 7.9280 0.9069 14.7056 12.6526 1.0590 9.2498 4.5064 32.5498 9.0094 22.0256 0.4895 2.6539 83.9024 29.0032 37.8811 6.8246 5.1208 124.9614 10.8862 25.7536 27.2153 47.5860 17.2726 10.5945 29.9750 4.4860 38.3825 331.1367 1.2973 159.8090 324.9496 21.3304 107.2464 13.7438 7.3640 1.6016 3.6199 20.8113 18.5886 10.3416 9.3904 9.7668 11.0547 16.5961 9.8324 5.1816 5.8533 8.4307 2.4020 3.8611 17.8893 17.6974 7.4219 2.2505 7.0098 9.1481 47.0058
temp: 298.150 k
press: 1.00000 atm
elementType: 8 7 7 6 6 6 6 6 6 6 6 6 6 6 6 6 6 6 6 6 6 6 6 6 1 1 1 1 1 1 1 1 1 1 1 1 1 1 1 1 1 1 1 1 1 1 1 1 1
symmnumber: 1
zpe: 1092613.2 jmol-1
zpe.correction: 0.416154 hartree
zpe.thermalcorrener: 0.436755 hartree
zpe.thermalcorrenthalpy: 0.437699 hartree
zpe.thermalcorrgfe: 0.369105 hartree
zpe.sumelectzpe: -997.961164 hartree
zpe.sumelectthermal: -997.940563 hartree
zpe.sumelectthermalent: -997.939619 hartree
zpe.sumelectthermalfe: -998.008214 hartree
dipole: -1.1617 8.2122 1.1311
dipole: 8.3707
quadrupole: -109.1342 -107.4628 -133.5666
quadrupole: 22.6349 3.6647 -8.0487
quadrupole: 7.5870 9.2584 -16.8454 22.6349 3.6647 -8.0487
hfenergy: -998.3773187 hartree
pointgroup: C01 [X(C21H25N2O1)]
dipole: 0.3166996 -3.2527379 0.4064121 debye
polarizability: 314.5533258|-31.6869264|258.3525582|-3.0610504|4.5616926|153.7855557 unknown
InChI: InChI=1S/C21H25N2O/c1-3-14-12-23(4-2)10-9-21-17-7-5-6-8-18(17)22-20(21)16(13-24)15(14)11-19(21)23/h3,5-8,13,15,19,22H,4,9-12H2,1-2H3
charge 1 multiplicity 1
49 atoms
O  -2.184287 3.808726 -0.798709
N  -1.0564 -1.999554 -0.112176
N  1.63295 1.979363 0.22204
C  -0.20197 -0.96821 -0.947007
C  0.65027 -0.161028 0.097028
C  -0.327175 -2.106823 1.237484
C  0.178909 -0.691402 1.513446
C  -1.137126 -0.080947 -1.785522
C  -1.887763 0.886355 -0.823381
C  -2.516162 -1.462521 0.066986
C  0.409733 1.352764 0.013291
C  -1.090545 -3.355188 -0.846274
C  2.173173 -0.25851 -0.015141
C  -2.62383 0.04107 0.236533
C  -0.835986 1.876572 -0.295748
C  2.70708 1.047556 0.154849
C  -1.87413 -4.453539 -0.11828
C  3.036967 -1.357058 -0.143234
C  -3.460696 0.522778 1.20042
C  -1.091061 3.309159 -0.390694
C  4.089694 1.289967 0.210966
C  4.438771 -1.13382 -0.103807
C  4.951701 0.172692 0.077039
C  -3.868624 1.955287 1.424148
H  0.461615 -1.577756 -1.583104
H  0.505942 -2.818862 1.104468
H  -1.017275 -2.495398 2.001066
H  -0.625871 -0.054652 1.9119
H  1.015147 -0.693619 2.229631
H  -1.829166 -0.698829 -2.387673
H  -0.52928 0.499596 -2.500793
H  -2.625117 1.496223 -1.380632
H  -2.953913 -2.001346 0.922207
H  -3.043528 -1.78966 -0.848774
H  -1.520477 -3.156631 -1.844095
H  -0.036523 -3.656484 -0.98219
H  1.765946 2.990027 0.216655
H  -1.813574 -5.375518 -0.722416
H  -1.450845 -4.687035 0.873382
H  -2.943661 -4.213002 -0.003798
H  2.656236 -2.376737 -0.282603
H  -3.91857 -0.208293 1.886942
H  -0.256038 3.986366 -0.07713
H  4.496366 2.297442 0.343222
H  5.128354 -1.975973 -0.215111
H  6.034969 0.327194 0.107797
H  -4.964662 2.01759 1.558148
H  -3.5805 2.625994 0.600234
H  -3.422768 2.347772 2.360306
