program: Gaussian 09
title: 000200322
version: EM64L-G09RevD.01
frameworkgroup: C1[X(C15H23NO)]
method: RPBEPBE
basis: SDD
operation: Freq
keyword: #p
keyword: freq=noraman
keyword: PBEPBE/SDD
title: #p freq=noraman PBEPBE/SDD
converged: YES YES NO NO
title: Mulliken charges:
elementType: O N C C C C C C C C C C C C C C C H H H H H H H H H H H H H H H H H H H H H H H
charge: -0.267909 -0.049115 0.248798 -0.507122 -0.496034 -0.444056 -0.423938 0.412590 -0.368545 -0.636710 -0.395656 -0.371258 -0.699199 -0.386956 -0.391702 0.320885 -0.537628 0.203511 0.237852 0.182906 0.237293 0.199583 0.199017 0.232126 0.173676 0.191276 0.230255 0.225348 0.226660 0.184087 0.236909 0.233803 0.206890 0.210101 0.217767 0.235625 0.246986 0.243621 0.219784 0.218482
chargesum: 0.00000
title: Mulliken charges with hydrogens summed into heavy atoms:
elementType: O N C C C C C C C C C C C C C C C
charge: -0.267909 -0.049115 0.248798 -0.065760 -0.075835 -0.045455 -0.018137 0.412590 0.052985 -0.000616 -0.158747 -0.137455 -0.064442 -0.151332 -0.144716 0.320885 0.144260
polarizability: 2.27093218e+02 1.01060357e+00 1.36111955e+02 3.62987104e-01 7.46434566e+00 1.52720940e+02
1716.lowfreq: -7.4282 -6.1577 0.0004 0.0005 0.0009 8.7315 19.4649 42.5364 59.1884
frequency: 13.4979 42.4622 59.1801 85.8756 95.1808 113.2182 129.3351 137.8657 189.5687 205.6987 220.3389 231.4565 234.8536 249.8193 271.7056 291.1157 299.0829 315.2915 347.2450 371.5555 413.7372 442.6853 483.9198 496.7577 544.9295 576.7205 589.6564 634.4063 702.4847 739.2944 747.8081 775.4947 810.6341 814.4458 833.8274 851.0021 871.4964 885.9083 917.6390 934.5764 960.5310 963.8912 977.4522 990.4410 1003.6036 1010.0876 1042.7345 1047.4686 1065.8860 1099.7598 1110.1942 1112.9024 1113.2318 1118.8911 1141.1319 1155.8373 1157.2431 1180.8658 1190.1652 1203.0357 1222.2438 1230.3036 1239.4983 1245.1520 1264.4166 1287.8087 1295.4758 1308.2411 1317.0723 1338.1206 1350.6914 1358.4834 1364.6285 1390.0206 1414.1488 1429.9251 1436.8825 1451.5600 1458.7233 1463.7045 1465.9279 1473.3616 1473.9239 1475.7553 1477.1506 1486.2625 1488.7956 1497.2786 1503.2402 1578.8118 1622.3260 2830.2293 2841.7362 2877.9592 2952.8624 2955.8218 2970.4121 2975.7692 3004.5754 3005.4644 3010.9989 3013.1522 3024.5911 3036.0128 3041.9604 3068.6117 3070.1860 3070.7052 3074.9892 3121.6364 3131.8943 3135.2782 3157.9532 3164.5677
redmass: 3.1555 3.2777 3.7901 2.4565 2.1294 3.0019 2.7633 2.5780 2.2968 2.6288 1.7424 1.1355 1.3145 1.5629 3.7247 2.3392 2.6173 2.9246 2.4649 3.9370 2.9611 3.3777 3.3690 3.0814 3.6180 2.9853 3.0677 6.5559 2.5896 3.4303 1.2288 4.5256 1.6039 2.4525 1.5370 1.7658 1.7178 2.0145 2.1545 1.4047 1.5169 1.6138 2.1130 7.4651 2.5385 1.5735 2.3080 1.8857 2.4419 1.3969 1.6612 1.9002 1.3091 1.5300 2.4379 1.5445 1.4614 1.3205 1.7143 2.1247 1.9689 2.4111 1.6102 1.7895 1.5066 1.2798 1.2730 1.2781 1.4103 1.4927 1.5055 1.4607 4.9941 1.2128 3.6907 1.1712 1.1675 1.0849 1.0895 1.0500 1.0501 1.0723 1.0581 1.0550 1.0439 1.0809 1.0824 1.2343 1.8819 7.0986 6.3567 1.0667 1.0621 1.0711 1.0583 1.0333 1.0356 1.0628 1.0751 1.0846 1.0875 1.0717 1.0855 1.1001 1.1038 1.1011 1.1010 1.0992 1.1046 1.0990 1.0874 1.0875 1.0946 1.0959
irintensity: 0.6590 0.8602 0.0763 1.8656 1.5923 1.3087 1.4809 1.4659 0.1063 1.3712 4.7753 0.4725 0.8954 3.4629 2.0121 2.4696 0.1317 2.4186 2.2237 0.4454 0.0443 0.5791 0.2376 3.2500 8.4312 16.0227 16.0380 0.8959 5.4887 2.1079 10.1335 4.6759 8.6258 21.3417 43.4390 4.7970 1.0524 8.4480 2.5576 1.0245 2.6591 2.6324 7.2524 36.1438 14.5842 4.4865 4.8043 15.1337 0.9587 6.9708 3.9079 9.7565 0.7261 4.0752 7.9852 1.6359 2.6102 99.6986 6.3174 8.0857 9.8249 126.4376 36.3034 14.6125 4.6547 0.5620 1.5025 1.4805 14.4415 4.7333 4.8811 2.9061 10.1660 10.9998 2.4278 0.3907 9.1788 8.2274 5.0560 22.9382 12.9560 57.5090 3.8226 5.2980 12.8257 6.1769 6.4561 6.5335 129.0102 5.1557 40.7969 58.7441 180.4488 118.6377 28.1910 70.7303 53.6418 26.9043 1.0955 35.5176 53.4689 55.7834 53.5778 19.4162 51.5168 81.7550 26.4552 50.3704 36.1638 31.4675 9.2577 18.2864 19.5136 3.8699
temp: 298.150 k
press: 1.00000 atm
elementType: 8 7 6 6 6 6 6 6 6 6 6 6 6 6 6 6 6 1 1 1 1 1 1 1 1 1 1 1 1 1 1 1 1 1 1 1 1 1 1 1
symmnumber: 1
zpe: 912537.9 jmol-1
zpe.correction: 0.347567 hartree
zpe.thermalcorrener: 0.365522 hartree
zpe.thermalcorrenthalpy: 0.366466 hartree
zpe.thermalcorrgfe: 0.300825 hartree
zpe.sumelectzpe: -714.016659 hartree
zpe.sumelectthermal: -713.998704 hartree
zpe.sumelectthermalent: -713.997760 hartree
zpe.sumelectthermalfe: -714.063401 hartree
dipole: -0.0714 0.5194 -1.7043
dipole: 1.7831
quadrupole: -90.9277 -109.7913 -99.6338
quadrupole: 2.7480 8.1703 2.8762
quadrupole: 9.1899 -9.6737 0.4838 2.7480 8.1703 2.8762
hfenergy: -714.3642259 hartree
pointgroup: C01 [X(C15H23N1O1)]
dipole: 0.002941 -0.3356004 0.6160524 debye
polarizability: 226.8731179|3.9313123|133.9981081|-2.3589968|3.4825145|155.054887 unknown
InChI: InChI=1S/C15H23NO/c1-4-9-15(10-11-16(2)12-15)13-5-7-14(17-3)8-6-13/h5-8H,4,9-12H2,1-3H3
charge 0 multiplicity 1
40 atoms
O  -4.566408 0.112302 -0.488324
N  2.914165 1.721855 -0.12268
C  1.183044 0.030779 0.296868
C  1.65942 0.76149 1.605709
C  2.01021 0.767664 -0.822676
C  1.620367 -1.477823 0.401313
C  3.07898 1.246416 1.266432
C  -0.340365 0.100726 0.103697
C  1.325242 -2.381241 -0.817207
C  4.147164 2.053001 -0.84432
C  -1.210967 0.097234 1.221432
C  -0.942864 0.091344 -1.185506
C  1.841536 -3.821355 -0.601697
C  -2.617907 0.100962 1.080848
C  -2.340014 0.0982 -1.350573
C  -3.186659 0.10446 -0.215441
C  -5.476991 0.120669 0.657232
H  1.638731 0.095962 2.487682
H  1.01783 1.637729 1.805478
H  2.593443 0.02355 -1.418088
H  1.366162 1.324384 -1.528123
H  1.11624 -1.91611 1.287631
H  2.710675 -1.507571 0.60931
H  3.420526 2.068467 1.922351
H  3.820511 0.409538 1.357035
H  1.796763 -1.959541 -1.728157
H  0.236002 -2.403243 -1.008532
H  4.719617 2.812335 -0.28117
H  3.902645 2.481125 -1.833512
H  4.815127 1.167633 -1.010243
H  -0.792483 0.097062 2.234118
H  -0.313317 0.076856 -2.082108
H  2.937649 -3.834401 -0.44925
H  1.374262 -4.280383 0.290231
H  1.613089 -4.465346 -1.470792
H  -3.247196 0.104992 1.976239
H  -2.795751 0.096448 -2.345611
H  -6.487469 0.128631 0.222518
H  -5.332766 1.024428 1.281514
H  -5.347844 -0.784329 1.283174
