program: Gaussian 09
title: 000200301
version: EM64L-G09RevD.01
frameworkgroup: C1[X(C17H25NO2)]
method: RPBEPBE
basis: SDD
operation: Freq
keyword: #p
keyword: freq=noraman
keyword: PBEPBE/SDD
title: #p freq=noraman PBEPBE/SDD
converged: YES YES NO NO
title: Mulliken charges:
elementType: O O N C C C C C C C C C C C C C C C C C H H H H H H H H H H H H H H H H H H H H H H H H H
charge: -0.288737 -0.231418 -0.079277 0.254008 -0.108369 -0.549318 -0.443022 -0.461312 0.461295 -0.707992 -0.383624 -0.645118 -0.506968 -0.427898 -0.698496 0.301388 -0.217751 -0.414684 0.262784 -0.758061 0.201196 0.224954 0.219413 0.226241 0.180583 0.220908 0.213028 0.227053 0.219076 0.211703 0.222632 0.197189 0.224054 0.226813 0.188711 0.308379 0.250740 0.216381 0.214332 0.207726 0.227421 0.256240 0.249864 0.249583 0.258351
chargesum: 0.00000
title: Mulliken charges with hydrogens summed into heavy atoms:
elementType: O O N C C C C C C C C C C C C C C C C C
charge: -0.288737 -0.231418 -0.079277 0.254008 0.092827 -0.104952 -0.036199 -0.027376 0.461295 -0.050160 0.036197 -0.005540 -0.198589 -0.177158 -0.060057 0.301388 0.009670 -0.158444 0.262784 -0.000263
polarizability: 2.38509554e+02 3.10292583e+00 1.70966410e+02 3.67285101e-01 -2.31099749e+01 1.79243973e+02
1716.lowfreq: -64.7504 -10.8899 -5.8120 -0.0011 -0.0008 -0.0004 6.6769 20.1640 33.8851
frequency: -64.7475 20.1321 33.8615 43.0243 50.5230 61.7859 67.3693 93.7949 105.1962 116.8260 169.9524 176.7049 203.6755 224.1250 226.7559 249.5089 255.5006 262.0963 273.6837 282.2534 315.6047 325.2248 326.8332 347.7485 362.2989 432.5463 456.7992 468.6443 508.5395 528.5569 562.4941 586.1633 631.8140 649.6380 654.6631 696.2171 712.6552 740.2984 757.0277 780.6911 802.1810 834.1666 851.6694 884.0778 893.1254 908.9597 930.0794 937.6260 967.6485 979.5123 983.4764 987.9732 999.6552 1003.5982 1027.2301 1044.8840 1050.2947 1056.5076 1060.4812 1083.8674 1098.6725 1111.0559 1121.0774 1125.2658 1141.0050 1147.2121 1166.7105 1176.7249 1179.2138 1181.8506 1210.7082 1226.1226 1236.3781 1263.7521 1291.4005 1295.4938 1304.7513 1307.5640 1324.2539 1334.2492 1344.3116 1352.0628 1377.7653 1381.9338 1383.8898 1387.7987 1421.3036 1434.7812 1453.8041 1458.4908 1461.2107 1462.2486 1463.2428 1467.1717 1469.8308 1473.2136 1476.7150 1476.9940 1477.7422 1486.2931 1514.8301 1592.3972 1602.8161 1645.1163 2838.2316 2857.4992 2912.1630 2968.7403 2972.0604 2979.6149 2979.9326 2989.7583 3006.2837 3008.0548 3009.6842 3013.5052 3036.6292 3063.9608 3068.4922 3071.5543 3074.7548 3076.1631 3084.7229 3094.8576 3135.8334 3143.3464 3160.5331 3173.8015 3194.2147
redmass: 1.0634 5.9032 3.9543 3.0671 2.2342 2.6233 3.6548 3.7997 3.2415 3.0491 1.3557 2.4517 2.0195 1.1656 1.3059 3.3294 3.2870 3.8743 2.4524 3.6180 2.8443 2.3006 4.5733 2.4439 3.8686 3.2168 3.1740 2.9810 4.4057 2.9996 3.3375 4.2659 3.9348 4.0839 4.7943 2.8417 2.2110 1.1790 2.7523 4.2612 1.6310 1.9067 1.7292 1.7830 2.9944 1.5331 1.8767 1.4026 2.5243 1.4215 1.9331 4.1019 1.8279 1.8265 1.8763 1.6041 2.0692 1.6582 1.9840 1.6890 1.3768 1.7962 2.2265 2.0940 2.1417 2.7491 1.4607 3.4296 1.8462 1.3515 2.7221 1.8613 1.7674 1.5105 1.3841 1.1993 1.4202 1.5851 1.5282 1.2844 1.4899 1.4911 6.0892 1.2504 1.2268 1.2121 2.8985 1.1696 1.0646 1.0459 1.0623 1.0640 1.0744 1.0643 1.0746 1.0738 1.2507 1.3361 1.2643 1.0776 1.0837 6.2603 6.7394 10.8978 1.0587 1.0712 1.0842 1.0495 1.0456 1.0530 1.0420 1.0813 1.0713 1.0367 1.0732 1.0927 1.1022 1.1002 1.1007 1.0999 1.1008 1.0997 1.1000 1.0972 1.0869 1.1009 1.0920 1.0980 1.0920
irintensity: 1.3960 1.0920 1.6716 0.6565 0.0048 0.2822 0.4968 1.2502 0.7874 1.0872 1.4399 1.7906 2.6106 0.3530 0.5524 2.2540 3.2236 0.3284 0.5911 0.8217 2.8031 0.5625 1.7235 0.7493 1.3084 0.0704 5.8953 1.0215 14.9603 0.3629 2.7212 1.6115 1.4478 2.6067 2.7463 2.4979 28.5678 12.1778 6.0388 11.2652 38.5396 4.5651 7.1829 3.4750 36.1447 1.8484 5.2927 20.4463 8.5690 0.1451 4.6617 3.0457 12.9966 54.7492 4.8385 8.9509 2.6645 35.4198 5.0041 8.3315 2.2303 12.9163 10.9749 15.9836 42.0337 15.3421 16.3466 380.0922 72.0053 69.0571 38.0773 10.3133 30.2362 5.5119 5.4715 0.0216 11.0995 10.0762 10.4037 6.8740 5.2073 1.8256 2.1967 17.4488 55.7955 9.8677 37.9553 3.4066 18.5735 17.6122 1.7691 6.6046 13.7778 12.8307 10.3549 8.8000 44.3942 10.3922 6.5979 12.9445 8.1516 42.2518 26.0351 178.1162 100.5496 153.5618 49.4991 11.0705 42.2233 34.7296 27.4929 48.5046 63.7407 3.8572 48.5735 10.2616 22.8182 25.6981 71.9381 29.0236 65.7732 40.7639 32.7335 6.2406 10.5699 7.3275 13.1922 10.5552 4.1620
temp: 298.150 k
press: 1.00000 atm
elementType: 8 8 7 6 6 6 6 6 6 6 6 6 6 6 6 6 6 6 6 6 1 1 1 1 1 1 1 1 1 1 1 1 1 1 1 1 1 1 1 1 1 1 1 1 1
symmnumber: 1
zpe: 1006490.4 jmol-1
zpe.correction: 0.383352 hartree
zpe.thermalcorrener: 0.404273 hartree
zpe.thermalcorrenthalpy: 0.405217 hartree
zpe.thermalcorrgfe: 0.332377 hartree
zpe.sumelectzpe: -866.457981 hartree
zpe.sumelectthermal: -866.437060 hartree
zpe.sumelectthermalent: -866.436116 hartree
zpe.sumelectthermalfe: -866.508956 hartree
dipole: -0.7809 1.0375 -0.2939
dipole: 1.3314
quadrupole: -104.9410 -121.7010 -122.7192
quadrupole: 2.8215 1.4324 -4.0209
quadrupole: 11.5127 -5.2472 -6.2654 2.8215 1.4324 -4.0209
hfenergy: -866.841333 hartree
pointgroup: C01 [X(C17H25N1O2)]
dipole: 0.351884 0.0712488 0.3814052 debye
polarizability: 235.8726662|-12.6581736|158.4287645|-7.8666371|-13.3045148|194.4185058 unknown
InChI: InChI=1S/C17H25NO2/c1-5-9-17(10-11-18(4)13(17)2)15-7-6-8-16(12-15)20-14(3)19/h6-8,12-13H,5,9-11H2,1-4H3
charge 0 multiplicity 1
45 atoms
O  3.494387 -0.650099 -0.416445
O  2.708221 0.447302 -2.349896
N  -3.46786 -0.503016 -0.985816
C  -1.476752 0.129716 0.272793
C  -1.971562 -0.520088 -1.089605
C  -2.670294 -0.211465 1.217619
C  -3.903487 0.020109 0.325696
C  -1.376185 1.682959 0.045982
C  -0.115778 -0.38769 0.759554
C  -1.485877 -1.958595 -1.372292
C  -1.072819 2.534393 1.299184
C  -4.214025 -0.040893 -2.15832
C  1.01336 -0.263915 -0.098471
C  0.068255 -0.944583 2.048658
C  -0.874962 4.02566 0.947548
C  2.27852 -0.699637 0.345627
C  1.345622 -1.376514 2.478197
C  2.462097 -1.25958 1.630158
C  3.631934 -0.086918 -1.699566
C  5.066296 -0.226046 -2.16428
H  -1.642537 0.134061 -1.929453
H  -2.691541 0.396299 2.137998
H  -2.629428 -1.277583 1.509276
H  -4.796684 -0.52191 0.693345
H  -4.168801 1.107022 0.293057
H  -2.318216 2.038734 -0.416991
H  -0.581035 1.868653 -0.703985
H  -0.406927 -1.999872 -1.604407
H  -1.6857 -2.616811 -0.507794
H  -2.043482 -2.363733 -2.236403
H  -0.162686 2.147346 1.797036
H  -1.897673 2.442616 2.033255
H  -5.290154 -0.263918 -2.031885
H  -3.870643 -0.574129 -3.063302
H  -4.115588 1.059059 -2.350584
H  0.907902 0.164701 -1.095949
H  -0.781416 -1.041056 2.730672
H  -0.675619 4.630581 1.851175
H  -0.0214 4.158862 0.256451
H  -1.773677 4.441793 0.453488
H  1.47005 -1.80353 3.479297
H  3.460474 -1.586213 1.935054
H  5.488029 0.778205 -2.345371
H  5.085569 -0.766779 -3.126413
H  5.680597 -0.757898 -1.424694
