program: Gaussian 09
title: 000200278
version: EM64L-G09RevD.01
frameworkgroup: C1[X(C10H11NS)]
method: RPBEPBE
basis: SDD
operation: Freq
keyword: #p
keyword: freq=noraman
keyword: PBEPBE/SDD
title: #p freq=noraman PBEPBE/SDD
converged: YES YES NO NO
title: Mulliken charges:
elementType: S N C C C C C C C C C C H H H H H H H H H H H
charge: 0.177471 -0.414056 0.349967 0.239145 -0.312357 -0.284021 -0.408394 -0.340419 -0.246476 -0.214462 -0.591995 -0.649679 0.307342 0.274919 0.247788 0.227003 0.261455 0.256868 0.221191 0.221723 0.227106 0.228801 0.221081
chargesum: 0.00000
title: Mulliken charges with hydrogens summed into heavy atoms:
elementType: S N C C C C C C C C C C
charge: 0.177471 -0.106714 0.349967 0.239145 -0.312357 -0.009102 -0.160606 -0.113416 -0.025285 0.007260 -0.073673 0.027309
polarizability: 1.75998069e+02 -5.13885936e+00 1.39836055e+02 5.41890123e+00 3.93852471e+00 7.48876558e+01
1716.lowfreq: -11.6766 -8.0575 -0.0014 0.0007 0.0021 2.6759 23.4673 54.0639 69.1143
frequency: 23.2436 54.0219 69.1093 158.9007 176.5053 218.3370 232.0832 271.6694 335.1248 422.9251 435.2979 455.7520 522.7273 549.7441 576.9114 599.9409 627.1692 636.8450 751.1112 755.0395 768.1105 782.7808 808.0024 856.9125 863.4276 936.3840 974.9074 981.1502 993.4011 1008.2540 1023.5206 1065.4090 1088.9962 1124.0235 1163.8570 1196.7036 1231.5123 1240.4357 1265.2444 1278.6369 1319.4985 1368.4473 1393.2784 1415.7738 1453.2448 1459.8303 1469.5706 1480.5486 1483.3591 1509.8743 1585.4765 1628.8575 2984.3806 3025.5176 3077.4364 3079.5637 3108.0335 3124.8599 3133.5054 3147.1716 3163.7287 3235.1700 3607.8726
redmass: 4.1748 1.8046 3.8646 6.0657 4.9663 3.8510 1.1354 3.4590 6.5927 2.9327 7.0131 4.8903 1.2545 7.0110 3.0286 3.8151 3.6359 6.3309 1.3354 5.3107 3.6828 1.1121 1.4077 1.4827 5.0402 1.3761 1.3096 4.6851 1.9072 2.1275 1.1891 2.3055 1.6464 1.4674 1.0868 2.2950 1.2699 1.6566 1.2855 2.4228 2.2126 3.1187 1.2084 2.6982 4.2182 1.0961 1.0402 2.8850 1.0493 4.8173 6.3011 7.1826 1.0353 1.0576 1.1014 1.0994 1.1076 1.0849 1.0890 1.0953 1.1002 1.0991 1.0809
irintensity: 1.4685 0.4845 1.6007 0.8153 0.4124 9.0188 0.2130 1.0304 1.7146 11.8438 0.6037 7.2065 96.9792 1.1406 8.5034 1.3315 2.3248 0.5993 110.2522 5.2866 10.2826 9.4736 16.8324 0.8566 0.6272 3.3331 0.2366 21.3984 12.8280 12.3754 0.9775 7.2380 30.3434 6.9578 0.9493 13.2988 0.2793 20.9472 17.0979 2.1786 8.6565 39.6686 18.5474 8.7972 17.6397 4.3998 14.0824 2.9588 8.3109 5.7573 2.0692 2.4536 38.0974 17.2399 10.9726 23.1188 40.8070 0.4879 6.7088 30.2152 29.2397 0.1357 60.9014
temp: 298.150 k
press: 1.00000 atm
elementType: 16 7 6 6 6 6 6 6 6 6 6 6 1 1 1 1 1 1 1 1 1 1 1
symmnumber: 1
zpe: 483166.5 jmol-1
zpe.correction: 0.184028 hartree
zpe.thermalcorrener: 0.195355 hartree
zpe.thermalcorrenthalpy: 0.196300 hartree
zpe.thermalcorrgfe: 0.145213 hartree
zpe.sumelectzpe: -839.615077 hartree
zpe.sumelectthermal: -839.603750 hartree
zpe.sumelectthermalent: -839.602806 hartree
zpe.sumelectthermalfe: -839.653893 hartree
dipole: 1.0576 1.6774 2.1246
dipole: 2.9062
quadrupole: -70.0472 -65.3254 -83.5209
quadrupole: 6.3492 -1.5155 2.8560
quadrupole: 2.9173 7.6391 -10.5564 6.3492 -1.5155 2.8560
hfenergy: -839.7991058 hartree
pointgroup: C01 [X(C10H11N1S1)]
dipole: 0.3194412 -0.8457384 -0.7000373 debye
dipolederiv: -0.0597357 -0.0689164 -0.0703326 -0.0491808 -0.1559745 0.0349111 -0.1773241 0.0668417 -0.0000929 -0.6915784 0.3277 -0.0053221 -0.0397502 -0.5419735 0.0285214 0.1087051 -0.0871048 -0.270434 0.0804732 0.2849979 0.0027141 0.172761 -0.1627459 0.0027665 0.0245384 -0.0851406 0.0217338 -0.1579671 0.0430611 0.0325753 0.3748464 0.4206547 -0.0680628 0.0358325 -0.0268612 0.0218236 0.2966396 -0.0973146 -0.0906693 0.0501978 -0.1489091 0.023587 -0.0461768 0.0040544 -0.2279815 0.2787984 -0.4225193 -0.0656019 -0.434892 0.1507399 0.0424668 -0.1040118 0.1103075 -0.1188914 0.0470075 -0.0293226 -0.0645816 0.0213794 0.0773226 -0.0170667 -0.0744412 0.0100656 -0.1342443 0.0786307 -0.0395481 -0.0708915 0.0211194 -0.0071703 -0.0100888 -0.0717809 0.0084572 -0.1647502 -0.1448086 -0.0211551 -0.0077479 0.0132953 0.1044286 -0.0122223 -0.0086844 0.004311 -0.1794146 0.0357434 -0.0124645 -0.0689732 -0.102005 -0.0452496 0.0229958 -0.0562125 -0.0013169 -0.1649346 0.1171968 -0.0075559 0.1984237 -0.014899 0.1493308 -0.0849569 0.3023755 -0.0782763 0.2262092 -0.0816899 0.0794252 0.0035513 0.0830176 0.03266 -0.0055725 -0.2155631 0.070656 0.0014422 0.137152 0.0144823 0.0502031 -0.0232604 0.2240867 0.001793 0.0490289 0.0083829 0.3321617 0.0780105 -0.055259 0.0365686 -0.0529208 0.0285486 0.0160099 0.0375943 0.0136748 0.1849576 0.0224412 0.1070041 0.0362912 0.0741085 0.01402 -0.0118198 0.0360907 -0.0236171 0.135912 -0.0238425 0.0812207 0.0481697 0.1196273 -0.024512 -0.0261657 0.0502991 -0.0169324 0.1625425 -0.0461418 -0.0588946 0.0446887 -0.0526455 0.0113045 0.0795295 0.0273511 0.0611903 -0.0553935 0.0325901 0.0330107 -0.0442094 0.005438 -0.0808389 -0.0891846 -0.0769779 -0.0561641 -0.0710145 0.0655539 -0.0525003 0.0245113 -0.0679033 -0.1286795 0.0184645 0.0267543 0.0183231 0.1557982 -0.1116306 -0.0592163 0.0727025 -0.0658546 0.0689122 0.0189728 0.0766703 0.0191136 0.142598 -0.0155479 -0.0605305 0.0611752 -0.1192406 0.0123087 0.0715529 0.1377633 0.0516472 0.0522325 0.096841 -0.0491271 -0.0250884 0.0024672 -0.0799843 -0.0934922 0.038251 -0.1310065 0.0461792 -0.0341357 0.0634221 -0.0981569 0.0842943 0.0817205 0.057061 -0.1200816 0.0593948 -0.0964388 unknown
polarizability: 175.5498654|0.5672012|138.3491623|-11.5301044|-8.7653012|76.822752 unknown
InChI: InChI=1S/C10H11NS/c1-2-12-10-7-11-9-6-4-3-5-8(9)10/h3-7,11H,2H2,1H3
charge 0 multiplicity 1
23 atoms
S  -2.452607 -0.058377 1.045687
N  0.823661 -2.252234 0.169415
C  0.362061 -0.011268 0.234192
C  1.392787 -0.983673 -0.022383
C  -0.840656 -0.750004 0.576617
C  -0.52227 -2.107998 0.529137
C  0.669919 1.3692 0.125034
C  2.70518 -0.61252 -0.38962
C  1.976627 1.745334 -0.240675
C  2.982162 0.765651 -0.497524
C  -3.15997 0.35926 -0.685271
C  -4.504916 1.077877 -0.512589
H  1.315674 -3.137921 0.074082
H  -1.157769 -2.967707 0.729577
H  -0.099116 2.120427 0.336544
H  3.483439 -1.35925 -0.583791
H  -2.417665 0.992338 -1.198862
H  -3.266088 -0.591321 -1.233466
H  2.233462 2.806993 -0.326934
H  3.989543 1.090975 -0.780334
H  -5.2320 0.44385 0.025983
H  -4.384252 2.019135 0.05265
H  -4.934009 1.323931 -1.50157
