program: Gaussian 09
title: 000200279
version: EM64L-G09RevD.01
frameworkgroup: C1[X(C12H25NO)]
method: RPBEPBE
basis: SDD
operation: Freq
keyword: #p
keyword: freq=noraman
keyword: PBEPBE/SDD
title: #p freq=noraman PBEPBE/SDD
converged: NO YES NO NO
title: Mulliken charges:
elementType: O N C C C C C C C C C C C C H H H H H H H H H H H H H H H H H H H H H H H H H
charge: -0.438782 -0.118286 0.418418 0.370296 -0.227098 -0.309423 -0.470238 -0.471612 -0.788999 -0.810890 -0.730385 -0.729530 -0.633513 -0.629970 0.213684 0.234015 0.196888 0.225101 0.224112 0.197121 0.211437 0.224060 0.216894 0.225890 0.244217 0.213947 0.344688 0.237871 0.225823 0.209629 0.210471 0.214793 0.219347 0.240038 0.185102 0.217811 0.222648 0.185526 0.228898
chargesum: 0.00000
title: Mulliken charges with hydrogens summed into heavy atoms:
elementType: O N C C C C C C C C C C C C
charge: -0.094094 -0.118286 0.418418 0.370296 -0.013415 -0.075408 -0.048248 -0.050379 -0.136609 -0.126836 -0.057062 -0.084919 0.009439 0.007102
polarizability: 1.45047627e+02 -1.55700507e+00 1.37543617e+02 -1.21768042e+00 -8.49105499e-01 1.30763785e+02
1716.lowfreq: -22.4419 -12.9966 -9.2678 -0.0003 0.0007 0.0008 62.7083 83.6188 96.1041
frequency: 62.6640 83.5723 95.7712 114.8399 123.7759 152.2223 154.6244 169.5436 192.6804 207.4290 222.6902 230.9354 236.5051 248.9084 259.7791 277.0075 287.0719 296.9421 314.8322 325.4353 340.2315 366.6525 371.7725 414.8435 444.4225 502.1988 553.4958 585.7419 626.9213 728.1361 748.6763 767.4502 776.7874 823.3022 878.0605 902.1353 926.8323 945.2716 964.0430 988.3205 991.8017 1016.4334 1027.7776 1035.5674 1056.6371 1068.1236 1083.3396 1087.0172 1093.7845 1130.5324 1139.2674 1168.0219 1170.5138 1179.9032 1201.5145 1218.9076 1237.9681 1252.2845 1261.7826 1275.5460 1293.8127 1305.4113 1320.0203 1340.5292 1350.6503 1373.1225 1383.7767 1389.5581 1390.7472 1400.4752 1417.4955 1442.1461 1458.2289 1459.9409 1463.6326 1464.4698 1471.0708 1473.4295 1474.7247 1477.9786 1480.8822 1483.7145 1486.2939 1487.0560 1493.6365 1499.3127 2844.2873 2847.3617 2862.6865 2956.9535 2961.7950 2974.8576 2975.8655 2981.7368 2994.2578 3010.6362 3027.2195 3031.2899 3036.9651 3044.9750 3055.0706 3058.8775 3060.0875 3064.8172 3071.1432 3074.3703 3084.1819 3086.6453 3096.5179 3108.8623 3558.1923
redmass: 2.7572 2.1701 2.4758 1.4000 2.2826 2.5559 1.9049 2.2718 1.4389 1.2364 1.2792 1.2766 1.9563 1.2995 1.5962 2.6724 2.3300 2.3371 2.8253 2.7671 2.5280 1.2087 2.6263 2.3826 2.6303 2.9635 3.0211 2.6948 2.6299 3.0694 1.5112 1.3866 3.2248 2.2860 3.1744 2.3516 1.8869 1.4000 1.7767 1.5902 1.5680 2.5490 1.5845 1.9436 1.8502 2.1414 2.2786 2.1421 1.2743 2.0111 1.6400 2.3727 2.0265 2.3760 1.9886 1.7865 1.7438 3.0313 1.7336 1.7464 1.3642 1.6141 1.3755 1.4672 1.2966 1.2211 1.2164 1.2002 1.2061 1.2105 1.1376 1.1831 1.0553 1.0596 1.0515 1.0550 1.0584 1.0568 1.0549 1.0486 1.0462 1.0556 1.0549 1.0554 1.0539 1.0590 1.0763 1.0581 1.0617 1.0612 1.0353 1.0366 1.0365 1.0365 1.0617 1.0980 1.0730 1.0743 1.0970 1.0884 1.0977 1.0977 1.0987 1.0982 1.0986 1.0992 1.0995 1.0993 1.0982 1.0964 1.0654
irintensity: 0.1828 1.0473 0.1190 2.3590 0.8025 0.6856 0.2301 0.0321 1.0151 0.2521 0.9655 1.0963 0.3115 1.2656 0.5159 5.1190 2.1486 0.1520 5.8521 0.3978 5.5079 115.9125 8.1638 24.3348 14.5035 1.5663 0.9237 6.1902 3.7092 6.0518 2.3894 2.9646 9.1688 4.3813 7.1182 13.7418 6.1584 2.0735 14.5581 10.9530 8.8080 142.8613 11.7907 4.5364 9.6242 5.1291 20.2871 2.0137 4.0947 14.9778 1.9544 0.8472 8.7740 2.6668 11.8190 9.9473 1.0466 8.6598 3.1756 3.6407 1.7683 2.8767 2.4270 0.5789 21.2755 23.5882 11.8351 15.0554 22.7058 8.0229 3.0097 8.4831 1.6150 6.2389 11.6962 5.6016 2.6201 16.4959 5.6835 10.3934 13.5244 22.9189 8.8549 2.5215 18.5196 10.9596 34.1908 55.7704 216.2946 41.7067 32.3734 29.3550 30.5698 46.1648 22.2588 14.6771 32.5922 52.5609 20.4569 12.8887 21.8608 48.6158 44.3494 40.5902 34.4500 65.6046 48.6246 14.6499 33.4117 25.6663 5.1826
temp: 298.150 k
press: 1.00000 atm
elementType: 8 7 6 6 6 6 6 6 6 6 6 6 6 6 1 1 1 1 1 1 1 1 1 1 1 1 1 1 1 1 1 1 1 1 1 1 1 1 1
symmnumber: 1
zpe: 917302.6 jmol-1
zpe.correction: 0.349382 hartree
zpe.thermalcorrener: 0.367252 hartree
zpe.thermalcorrenthalpy: 0.368197 hartree
zpe.thermalcorrgfe: 0.306364 hartree
zpe.sumelectzpe: -601.025099 hartree
zpe.sumelectthermal: -601.007229 hartree
zpe.sumelectthermalent: -601.006285 hartree
zpe.sumelectthermalfe: -601.068117 hartree
dipole: -1.4324 -1.6404 -0.1800
dipole: 2.1852
quadrupole: -90.7532 -92.1997 -89.1169
quadrupole: -3.5128 -1.3060 -2.2739
quadrupole: -0.0633 -1.5097 1.5730 -3.5128 -1.3060 -2.2739
hfenergy: -601.3744815 hartree
pointgroup: C01 [X(C12H25N1O1)]
dipole: 0.5819527 0.6096852 0.1695715 debye
polarizability: 144.2227865|-2.5812624|137.0404929|2.8862362|1.8652621|132.0917489 unknown
InChI: InChI=1S/C12H25NO/c1-7-12(8-2)9(13(5)6)11(3,4)10(12)14/h9-10,14H,7-8H2,1-6H3
charge 0 multiplicity 1
39 atoms
O  -1.608504 -2.020163 -0.98115
N  1.676839 1.111696 -0.230527
C  -0.833485 0.309877 -0.031745
C  0.715325 -1.347517 0.031907
C  0.697558 0.197667 0.395108
C  -0.868261 -1.271186 0.024211
C  -1.030516 0.853736 -1.478377
C  -1.809195 1.024013 0.945998
C  1.28133 -2.270147 1.128746
C  1.306573 -1.728835 -1.344446
C  -2.500009 0.918871 -1.966271
C  -1.567496 0.823102 2.458968
C  3.073262 0.714454 0.066656
C  1.456164 2.512341 0.205202
H  0.772435 0.273058 1.510223
H  -1.290049 -1.642431 0.974412
H  -0.434973 0.252879 -2.19214
H  -0.590556 1.866106 -1.54112
H  -2.831609 0.66946 0.706666
H  -1.808475 2.113759 0.733596
H  0.830283 -2.048159 2.114596
H  1.070639 -3.330572 0.892109
H  2.377918 -2.155759 1.226779
H  0.779456 -2.615136 -1.7470
H  1.247683 -0.903827 -2.074462
H  2.372147 -2.00605 -1.253326
H  -1.317346 -1.727455 -1.881308
H  -3.011964 -0.05432 -1.86152
H  -3.083868 1.666609 -1.401269
H  -2.533514 1.214907 -3.031633
H  -1.505831 -0.247254 2.732973
H  -0.637789 1.312726 2.800325
H  -2.402359 1.261177 3.036759
H  3.276838 -0.293688 -0.324791
H  3.300521 0.714582 1.16403
H  3.76639 1.420263 -0.425916
H  2.148972 3.181347 -0.336661
H  1.625257 2.653863 1.303841
H  0.425107 2.829407 -0.018444
