program: Gaussian 09
title: 000200268
version: EM64L-G09RevD.01
frameworkgroup: C1[X(C13H19N3O)]
method: RPBEPBE
basis: SDD
operation: Freq
keyword: #p
keyword: freq=noraman
keyword: PBEPBE/SDD
title: #p freq=noraman PBEPBE/SDD
converged: YES YES NO NO
title: Mulliken charges:
elementType: O N N N C C C C C C C C C C C C C H H H H H H H H H H H H H H H H H H H
charge: -0.265149 -0.095298 -0.189593 -0.103573 -0.451041 -0.353196 -0.236418 0.039536 0.315358 0.106425 -0.344547 -0.344856 -0.624385 -0.606027 -0.631245 -0.249374 -0.201848 0.221761 0.220653 0.192467 0.209394 0.247027 0.210225 0.252814 0.236901 0.235683 0.188457 0.222238 0.221908 0.186202 0.224820 0.261410 0.229289 0.229219 0.223248 0.221514
chargesum: 0.00000
title: Mulliken charges with hydrogens summed into heavy atoms:
elementType: O N N N C C C C C C C C C C C C C
charge: -0.265149 -0.095298 -0.189593 -0.103573 -0.008627 0.048665 0.220834 0.039536 0.315358 0.106425 -0.091733 -0.107955 0.021993 0.026903 0.088673 -0.026125 0.019666
polarizability: 2.25227458e+02 -9.68959228e+00 1.75097443e+02 8.92508773e+00 -6.45305737e-01 1.02897862e+02
1716.lowfreq: -20.2810 -4.4538 0.0004 0.0005 0.0006 3.5493 9.0964 19.0644 35.2633
frequency: -20.1530 18.7885 34.7703 48.3215 66.6820 97.2748 119.3178 129.0530 179.7405 192.6240 228.0653 234.1263 237.1079 253.2543 274.0020 294.5117 335.3769 356.6379 370.7288 418.8007 426.2743 511.0099 527.5816 552.7658 569.0385 613.6585 631.2888 655.4443 744.5284 745.7137 753.3254 753.7476 808.9613 814.3495 847.9250 877.4438 942.6908 943.9211 961.1935 971.7032 977.0967 1006.5971 1035.8594 1053.0246 1065.1239 1077.2618 1092.3461 1107.8102 1119.7862 1131.7050 1139.6993 1141.7715 1154.6749 1175.7174 1218.9480 1233.0295 1251.0107 1272.3925 1280.1398 1281.0550 1316.1869 1351.5972 1363.1604 1373.9601 1377.6968 1410.9446 1418.7597 1426.8101 1435.9703 1442.0364 1460.1882 1461.9594 1470.4435 1474.1836 1476.6598 1477.5027 1480.2102 1485.4847 1490.5903 1491.9624 1514.1265 1584.8612 1628.0822 2831.0139 2844.8061 2861.4236 2972.9253 2995.6053 3002.7897 3009.8544 3018.5207 3027.8799 3047.5450 3051.2393 3076.4919 3079.2321 3084.1518 3127.2849 3128.2562 3143.4702 3156.6587 3169.4155
redmass: 1.1121 3.9242 3.5723 3.1086 3.9697 3.8158 2.4948 2.5523 4.1887 2.3112 1.5667 5.3869 1.3839 2.0061 2.8191 1.8933 2.9311 7.8998 2.3168 2.0779 2.9662 3.7971 5.5281 4.3621 4.3312 5.5617 5.9446 6.1568 2.8823 2.1800 5.0012 1.6766 6.2220 1.6195 1.3936 1.7120 1.3677 4.8102 2.2567 3.3290 1.3012 2.1029 1.5200 4.6429 1.9500 1.6421 1.4408 2.2797 1.2873 1.4611 1.6369 1.9360 1.2991 1.3046 1.7014 2.3472 1.6899 1.6288 1.4879 2.1115 1.2866 2.4223 1.5621 3.1303 1.6606 2.8990 1.1443 4.2417 1.4745 1.1688 1.0597 1.0623 1.0427 1.0593 1.1114 1.2773 1.2586 1.0645 1.1582 1.5164 5.7597 7.1217 7.7728 1.0699 1.0573 1.0579 1.0367 1.0606 1.0732 1.0741 1.0720 1.0722 1.1019 1.0999 1.1025 1.1042 1.1009 1.0955 1.0865 1.0891 1.0958 1.0998
irintensity: 0.2631 0.0813 1.4384 1.0339 1.1247 1.1842 5.8076 1.6252 0.2021 0.3254 0.1736 0.4972 0.2625 2.1815 3.6767 2.5923 17.9082 1.0695 0.1340 0.7951 4.9527 2.3839 4.7093 3.9084 3.7631 5.2652 8.2808 19.2534 36.1770 10.9019 12.5191 57.8425 3.3081 6.6793 0.0593 3.0087 1.5226 80.0263 6.6058 43.5854 0.0137 13.8373 17.6270 47.8699 20.0191 1.3594 14.8406 18.5337 0.4959 5.8322 17.2964 45.9673 3.7953 29.0827 12.9684 45.1896 8.5254 3.5452 4.3555 4.0280 46.0564 52.2617 25.7859 9.7567 36.0880 69.8730 2.8109 40.4526 48.2787 4.1629 7.0539 10.5764 15.2346 17.5029 2.9724 35.2377 5.6365 11.0766 12.5172 37.2006 192.5986 1.1509 45.3830 68.6824 75.1676 284.8749 78.6491 12.8726 14.6520 42.3227 42.5942 34.9620 32.9093 7.5314 2.2085 94.0137 36.2967 5.1199 1.1008 9.7477 24.8985 22.5677
temp: 298.150 k
press: 1.00000 atm
elementType: 8 7 7 7 6 6 6 6 6 6 6 6 6 6 6 6 6 1 1 1 1 1 1 1 1 1 1 1 1 1 1 1 1 1 1 1
symmnumber: 1
zpe: 791920.3 jmol-1
zpe.correction: 0.301627 hartree
zpe.thermalcorrener: 0.318329 hartree
zpe.thermalcorrenthalpy: 0.319273 hartree
zpe.thermalcorrgfe: 0.255594 hartree
zpe.sumelectzpe: -744.926468 hartree
zpe.sumelectthermal: -744.909766 hartree
zpe.sumelectthermalent: -744.908821 hartree
zpe.sumelectthermalfe: -744.972500 hartree
dipole: -0.6674 1.1059 0.0576
dipole: 1.2930
quadrupole: -82.0089 -93.7210 -103.6823
quadrupole: 6.5494 1.4305 -0.1659
quadrupole: 11.1285 -0.5836 -10.5449 6.5494 1.4305 -0.1659
hfenergy: -745.2280941 hartree
pointgroup: C01 [X(C13H19N3O1)]
dipole: 0.273296 -0.4275272 0.0359841 debye
polarizability: 225.9059621|-8.5640268|174.6119057|-7.1100287|-1.3245949|102.7048958 unknown
InChI: InChI=1S/C13H19N3O/c1-15(2)9-6-10-17-13-11-7-4-5-8-12(11)16(3)14-13/h4-5,7-8H,6,9-10H2,1-3H3
charge 0 multiplicity 1
36 atoms
O  0.505033 0.877839 -0.327896
N  4.70253 -0.18942 0.334896
N  -1.857358 -1.733579 -0.038114
N  -0.519623 -1.29878 -0.182609
C  2.867281 1.297652 -0.579559
C  4.291368 0.729114 -0.756052
C  1.822778 0.191698 -0.431441
C  -1.949058 0.533628 -0.068554
C  -2.738915 -0.664277 0.033183
C  -0.594295 0.056797 -0.198413
C  -2.571755 1.805192 -0.026082
C  -4.1488 -0.616083 0.177547
C  4.818774 0.478976 1.646602
C  5.929295 -0.935678 -0.009774
C  -2.147203 -3.160063 0.019247
C  -3.970716 1.856633 0.117402
C  -4.745088 0.657875 0.217482
H  2.812998 1.971569 0.295409
H  2.622253 1.913526 -1.465635
H  5.007669 1.586201 -0.864997
H  4.334799 0.154615 -1.702255
H  1.989225 -0.422019 0.471264
H  1.807266 -0.485778 -1.307189
H  -1.973572 2.718517 -0.103309
H  -4.751964 -1.526517 0.254798
H  3.850924 0.917348 1.944214
H  5.586534 1.295214 1.656841
H  5.099251 -0.264894 2.413422
H  6.155522 -1.667534 0.786378
H  6.828491 -0.279613 -0.139545
H  5.774885 -1.492575 -0.951354
H  -1.190457 -3.696107 -0.062269
H  -2.630868 -3.433657 0.975835
H  -2.804793 -3.470808 -0.814357
H  -4.480849 2.825166 0.15377
H  -5.832865 0.735618 0.328114
