program: Gaussian 09
title: 000200241
version: EM64L-G09RevD.01
frameworkgroup: C1[X(C14H22O)]
method: RPBEPBE
basis: SDD
operation: Freq
keyword: #pfreq=noraman
keyword: PBEPBE/SDD
title: #p freq=noraman PBEPBE/SDD
converged: NO YES NO NO
title: Mulliken charges:
elementType: O C C C C C C C C C C C C C C H H H H H H H H H H H H H H H H H H H H H H
charge: -0.442935 -0.000938 -0.420976 -0.591864 -0.421240 -0.364981 0.401901 -0.356188 -0.721636 0.116870 -0.698632 -0.398799 -0.403143 -0.260854 -0.214968 0.233985 0.184410 0.212154 0.217588 0.207999 0.200084 0.207353 0.186349 0.196474 0.195771 0.192994 0.212308 0.225915 0.219886 0.208644 0.209663 0.214162 0.236668 0.212657 0.224750 0.225368 0.353200
chargesum: 0.00000
title: Mulliken charges with hydrogens summed into heavy atoms:
elementType: O C C C C C C C C C C C C C C
charge: -0.089735 0.233048 -0.024411 -0.166276 -0.013803 0.017841 0.401901 0.032576 -0.063528 0.116870 -0.066162 -0.162131 -0.190486 -0.036103 0.010400
polarizability: 1.65568300e+02 -2.34802196e+01 1.49406450e+02 8.71787315e+00 1.11187685e+01 1.40809473e+02
1716.lowfreq: -24.1690 -14.2563 -0.0004 0.0004 0.0006 12.7735 22.1515 28.2610 42.9389
frequency: 21.6397 28.0996 42.4863 63.7546 69.7419 95.2916 115.2734 138.8583 170.2319 204.2339 226.4447 247.3442 259.5039 296.4633 302.9188 320.2522 360.7946 384.6162 433.0072 442.8701 479.1235 510.9152 536.5097 556.7535 608.3242 715.9793 725.7456 749.9897 752.0490 761.3388 787.3163 818.8375 832.1458 851.1181 877.0385 890.0030 928.1083 929.8548 962.2270 969.8105 988.0678 1021.1857 1031.6879 1039.2644 1064.9657 1070.6566 1084.0951 1107.3744 1127.6818 1148.3937 1155.6298 1170.2452 1189.7361 1212.9938 1216.2714 1238.2075 1253.6405 1262.4300 1268.8235 1283.9520 1289.9840 1303.7754 1319.4082 1332.0290 1340.2133 1349.6251 1361.7780 1388.1753 1388.3021 1395.0779 1435.8428 1461.3999 1462.9777 1467.2398 1475.8657 1476.2446 1477.4801 1484.9075 1486.2246 1491.9498 1494.1365 1601.0750 1614.3775 2951.9534 2957.3873 2965.7541 2968.1952 2971.0201 2975.0864 2981.1313 2985.0588 2992.3382 3011.1634 3019.3822 3033.3376 3042.8357 3067.2283 3068.3211 3069.8991 3071.8410 3107.4907 3122.6553 3140.8491 3163.9603 3579.0562
redmass: 4.0196 2.5078 3.5560 1.8534 3.1773 2.8537 2.8924 2.3957 3.4219 1.4454 1.1104 3.8348 2.0697 2.1288 3.0146 2.6154 1.1458 3.2043 2.7422 2.9788 2.8294 3.1668 3.6670 4.1581 4.5141 2.6249 1.1450 1.7169 2.5779 1.3752 1.3094 1.8171 2.2574 2.0997 1.7462 1.9384 1.3801 1.4175 1.8773 1.3286 2.0244 1.4212 2.9100 2.1604 2.0671 2.3238 1.9923 1.7644 1.8561 1.9390 1.3457 1.0724 1.5058 1.6910 1.7944 2.4818 1.3416 1.2040 1.2509 1.0689 1.1991 1.3545 1.3049 1.5200 1.4617 1.5402 1.4046 1.2185 1.2706 5.7644 2.2396 1.1262 1.0772 1.0770 1.0540 1.0507 1.0657 1.0581 1.0740 1.0780 2.5711 6.3295 6.7969 1.0594 1.0610 1.0632 1.0629 1.0363 1.0417 1.0582 1.0722 1.0952 1.1007 1.0999 1.1034 1.1021 1.1006 1.0990 1.0993 1.1001 1.0885 1.0881 1.0922 1.1004 1.0659
irintensity: 0.0570 0.0214 0.1693 0.0108 0.4691 0.0834 0.8554 0.2602 0.6643 0.0772 0.0004 5.7290 0.1164 0.2217 4.5510 5.0414 118.6372 1.4214 5.1324 4.6365 6.5705 1.6413 5.0388 0.4144 4.1622 13.7765 6.3066 57.6859 34.1037 2.3195 8.8844 5.4065 9.3407 4.4321 3.2898 5.8162 1.4598 2.3200 6.9500 0.8764 7.6445 1.2381 2.1694 8.6395 38.2923 18.0917 25.0456 38.2441 19.5473 7.6835 33.8355 0.9872 7.4535 13.5037 2.1753 34.6242 5.8185 7.7310 4.0157 0.0347 1.1341 14.5973 6.8448 2.1179 3.1902 2.1782 0.8725 12.4291 19.7254 8.8527 27.5767 7.6097 1.0433 0.8262 4.8472 11.6416 6.3223 2.3779 30.5848 2.3708 29.5106 17.1332 2.4916 0.9606 7.2302 70.7859 4.6740 39.3269 31.2233 37.2588 45.6713 6.1204 2.5261 28.9019 74.4445 32.2081 86.3520 53.9428 61.7544 59.1759 16.9246 6.4549 23.9804 25.0316 24.4519
temp: 298.150 k
press: 1.00000 atm
elementType: 8 6 6 6 6 6 6 6 6 6 6 6 6 6 6 1 1 1 1 1 1 1 1 1 1 1 1 1 1 1 1 1 1 1 1 1 1
symmnumber: 1
zpe: 852616.5 jmol-1
zpe.correction: 0.324744 hartree
zpe.thermalcorrener: 0.341693 hartree
zpe.thermalcorrenthalpy: 0.342637 hartree
zpe.thermalcorrgfe: 0.278273 hartree
zpe.sumelectzpe: -620.738102 hartree
zpe.sumelectthermal: -620.721154 hartree
zpe.sumelectthermalent: -620.720210 hartree
zpe.sumelectthermalfe: -620.784574 hartree
dipole: 0.9894 -0.4460 0.9704
dipole: 1.4558
quadrupole: -89.0083 -94.3806 -86.1410
quadrupole: -3.6305 7.5214 1.5815
quadrupole: 0.8350 -4.5373 3.7023 -3.6305 7.5214 1.5815
hfenergy: -621.0628468 hartree
pointgroup: C01 [X(C14H22O1)]
dipole: -0.3889221 -0.1443171 -0.3949452 debye
polarizability: 164.1029652|22.6351707|153.6470176|11.4740725|-9.6359674|138.03424 unknown
InChI: InChI=1S/C14H22O/c1-3-5-8-12(4-2)11-13-9-6-7-10-14(13)15/h6-7,9-10,12,15H,3-5,8,11H2,1-2H3
charge 0 multiplicity 1
37 atoms
O  -2.043487 1.290462 -1.627524
C  0.862062 1.125017 -0.120924
C  1.647911 -0.137042 0.323371
C  -0.450534 1.300805 0.714421
C  1.710115 2.429613 -0.090071
C  2.886111 -0.458939 -0.544335
C  -1.488667 0.222635 0.463644
C  3.556031 -1.800211 -0.164784
C  2.278532 2.82382 1.293164
C  -2.274205 0.229828 -0.722496
C  4.796529 -2.120296 -1.026592
C  -1.721296 -0.826978 1.384877
C  -3.243808 -0.766989 -0.978416
C  -2.685301 -1.83502 1.147896
C  -3.448172 -1.803617 -0.040184
H  0.549603 0.975536 -1.175551
H  1.960969 -0.028556 1.383304
H  0.961116 -1.007077 0.294569
H  -0.881555 2.288163 0.45882
H  -0.197812 1.31638 1.792077
H  1.078251 3.258332 -0.469624
H  2.548529 2.332045 -0.80751
H  2.585672 -0.491173 -1.613089
H  3.636045 0.35352 -0.456481
H  2.813051 -2.617952 -0.263488
H  3.844934 -1.772283 0.906137
H  2.852113 3.766612 1.224181
H  1.475202 2.978699 2.036559
H  2.960312 2.049109 1.689717
H  5.565917 -1.331953 -0.92161
H  4.527699 -2.184104 -2.098056
H  5.256547 -3.082759 -0.735593
H  -1.133016 -0.845767 2.31038
H  -3.838038 -0.734202 -1.9018
H  -2.84052 -2.631868 1.882794
H  -4.199992 -2.575225 -0.238838
H  -2.662049 1.229534 -2.397145
