program: Gaussian 09
title: 000200291
version: EM64L-G09RevD.01
frameworkgroup: C1[X(C18H27NO2)]
method: RPBEPBE
basis: SDD
operation: Freq
keyword: #p
keyword: freq=noraman
keyword: PBEPBE/SDD
title: #p freq=noraman PBEPBE/SDD
converged: YES YES NO NO
title: Mulliken charges:
elementType: O O N C C C C C C C C C C C C C C C C C C H H H H H H H H H H H H H H H H H H H H H H H H H H H
charge: -0.294997 -0.220787 -0.023926 0.265156 -0.552340 -0.536926 -0.469620 -0.471192 0.468282 -0.366053 -0.636356 -0.594659 -0.434760 -0.697614 0.358090 -0.228754 -0.356720 0.215436 -0.488757 -0.339643 -0.683838 0.223416 0.238745 0.231433 0.211367 0.201098 0.209985 0.233669 0.217588 0.200927 0.227991 0.230117 0.205575 0.223371 0.273605 0.231661 0.218388 0.210472 0.208132 0.225821 0.304645 0.241940 0.243048 0.219893 0.215801 0.224041 0.208739 0.208507
chargesum: 0.00000
title: Mulliken charges with hydrogens summed into heavy atoms:
elementType: O O N C C C C C C C C C C C C C C C C C C
charge: -0.294997 -0.220787 -0.023926 0.265156 -0.090179 -0.094126 -0.058536 -0.019935 0.468282 0.062865 0.022707 -0.321055 -0.203099 -0.060623 0.358090 -0.002933 -0.052074 0.215436 -0.003769 0.096051 -0.042550
polarizability: 2.69050497e+02 3.73098769e-01 1.71555752e+02 2.93604758e+00 1.33575983e+01 1.89674459e+02
1716.lowfreq: -10.0881 -0.4492 -0.0008 -0.0005 0.0006 5.1006 16.7587 24.7886 27.5551
frequency: 16.3252 24.7311 27.4393 34.3144 50.3183 59.8301 70.3506 90.8139 101.4859 109.5847 134.9731 144.1732 189.9578 204.0774 210.3996 223.5193 228.5892 246.0814 255.0697 277.6828 284.4432 305.4361 322.7659 362.4825 372.5769 385.5990 406.6148 453.6820 460.0471 508.3691 534.7228 570.3291 604.1012 614.6034 647.3197 684.7921 709.8719 712.4625 735.3855 739.9120 779.0692 804.8848 806.1471 843.7604 864.7217 866.2344 868.8897 885.7762 900.4578 912.9684 921.9670 936.6941 942.5454 973.8460 985.9144 987.5028 991.5239 1014.1248 1030.2950 1051.7122 1054.6585 1065.7234 1087.7136 1097.4364 1100.3360 1102.6381 1114.8895 1122.7673 1124.7778 1126.2567 1137.9967 1164.5284 1190.4664 1200.2613 1218.6490 1220.9402 1237.9035 1257.9683 1280.1251 1284.7779 1286.2242 1288.8797 1295.4105 1302.9215 1306.2119 1322.8621 1332.9137 1347.6773 1359.6856 1374.8216 1391.4934 1393.4014 1423.3044 1427.6134 1438.0925 1449.8890 1461.1131 1463.7665 1469.9317 1473.0544 1473.5449 1473.5832 1476.5209 1477.9995 1478.4708 1485.4113 1485.9672 1486.0202 1572.9246 1614.1586 1650.6494 2884.4679 2948.4108 2971.7508 2974.7373 2977.4123 2980.8662 2986.1722 2989.7677 3003.1717 3004.6695 3005.6225 3025.9898 3030.1839 3036.1286 3051.4219 3061.9877 3069.8328 3072.4812 3073.1767 3078.2156 3078.3429 3080.1457 3083.5186 3132.3136 3154.2771 3158.1956 3213.9004
redmass: 3.8645 3.1617 2.4588 2.9975 3.7692 3.8389 3.2433 2.0086 2.9867 2.3972 3.9661 3.1520 1.1154 2.8059 3.7044 1.0921 1.4123 2.4645 3.9465 3.0579 2.7600 4.3852 3.5299 3.6895 3.1844 2.0969 2.1562 2.9240 3.4030 2.9773 2.8111 7.5910 3.3418 4.1847 4.6182 4.2806 2.6957 3.5556 1.1732 1.1931 3.5337 1.7249 2.6643 2.1230 2.0302 1.3267 1.7247 2.0477 1.7247 1.9866 1.3807 2.4428 2.2112 2.2637 2.1092 1.9951 2.1888 1.9628 2.7341 2.3798 2.5946 1.9510 2.7386 1.6873 1.7853 1.7056 1.9497 2.1995 1.8096 2.0502 1.8478 1.8822 1.3346 1.5175 1.3366 1.9798 1.5355 1.4397 1.3007 1.2120 1.2523 1.3878 1.2425 1.5436 1.2498 1.3190 1.4113 1.4883 1.6901 7.2235 1.2114 1.2143 2.8071 1.1641 1.0956 1.0947 1.1095 1.0639 1.2800 1.0778 1.0563 1.2554 1.3357 1.0522 1.0422 1.0744 1.0786 1.0725 6.1781 6.8162 10.1804 1.0532 1.0601 1.0357 1.0361 1.0625 1.0654 1.0615 1.0672 1.0719 1.0609 1.0842 1.0763 1.0976 1.1005 1.1004 1.1010 1.1010 1.0993 1.1017 1.0989 1.1021 1.1008 1.0991 1.0870 1.0930 1.0934 1.0947
irintensity: 0.2261 1.7602 0.1356 0.0328 0.0813 0.2497 0.1866 0.0603 3.6656 0.3182 0.6144 0.9502 0.4475 0.8508 1.3321 0.1359 2.2001 3.8627 1.6503 0.2576 0.7600 5.2538 2.8428 2.4098 3.9598 3.7777 1.0657 2.1776 0.7426 0.6808 0.3123 4.6854 7.9862 3.2675 6.9293 5.0632 21.3132 14.9633 13.3040 22.7052 4.8858 30.8289 17.3219 0.5275 7.8362 0.2588 8.5658 4.6993 8.9507 2.6359 7.1267 65.2382 9.1067 54.9390 1.4007 2.5701 0.6777 16.5498 7.0104 51.6576 9.2853 16.4673 223.0833 33.3006 59.8813 7.5489 55.5630 179.1482 86.2625 55.6221 54.7439 25.7895 17.9378 22.8334 1.0209 20.9595 1.8977 2.9843 4.6088 26.3367 8.8490 36.8015 1.4188 3.8455 1.3479 3.0046 7.1326 5.8758 26.2358 22.3321 11.3415 7.8146 28.6792 4.0313 19.1108 11.8147 9.6108 10.8237 7.0002 20.9958 2.6632 40.9150 21.6094 5.8912 13.1708 3.6952 9.5547 18.4501 48.6550 43.0253 200.6638 89.1358 24.9050 52.5696 37.5621 13.4247 60.8966 8.0265 47.8530 4.2428 22.1168 33.7095 62.5831 1.9525 19.2610 0.0604 25.9276 77.6198 46.9021 9.5946 48.8846 74.7917 49.4232 40.2904 10.2912 18.8290 4.3712 3.8634
temp: 298.150 k
press: 1.00000 atm
elementType: 8 8 7 6 6 6 6 6 6 6 6 6 6 6 6 6 6 6 6 6 6 1 1 1 1 1 1 1 1 1 1 1 1 1 1 1 1 1 1 1 1 1 1 1 1 1 1 1
symmnumber: 1
zpe: 1083139.4 jmol-1
zpe.correction: 0.412546 hartree
zpe.thermalcorrener: 0.435350 hartree
zpe.thermalcorrenthalpy: 0.436294 hartree
zpe.thermalcorrgfe: 0.357481 hartree
zpe.sumelectzpe: -905.675923 hartree
zpe.sumelectthermal: -905.653119 hartree
zpe.sumelectthermalent: -905.652175 hartree
zpe.sumelectthermalfe: -905.730988 hartree
dipole: 0.3039 -0.4869 -1.8518
dipole: 1.9388
quadrupole: -131.6012 -127.3220 -124.8008
quadrupole: -7.0634 -8.2677 1.4402
quadrupole: -3.6932 0.5860 3.1072 -7.0634 -8.2677 1.4402
hfenergy: -906.0884694 hartree
pointgroup: C01 [X(C18H27N1O2)]
dipole: 0.1297263 0.4240316 -0.6206276 debye
polarizability: 265.9218706|-17.1233737|172.0953979|-5.9586391|-10.4016419|192.2634398 unknown
InChI: InChI=1S/C18H27NO2/c1-4-7-17(20)21-16-9-6-8-15(13-16)18(10-5-2)11-12-19(3)14-18/h6,8-9,13H,4-5,7,10-12,14H2,1-3H3
charge 0 multiplicity 1
48 atoms
O  2.44118 -0.202537 -0.348267
O  4.064892 -1.241427 1.011418
N  -4.32969 -0.579569 -1.021599
C  -2.387645 0.696594 -0.077553
C  -2.367255 0.685722 -1.652513
C  -3.770829 -0.032137 0.246042
C  -2.445876 2.188975 0.411491
C  -3.840356 0.381918 -2.049566
C  -1.147065 0.019463 0.533456
C  -2.596505 2.410462 1.93362
C  -3.930579 -1.983443 -1.293116
C  0.109993 0.140607 -0.108939
C  -1.18243 -0.667948 1.777826
C  -2.718236 3.909173 2.286889
C  1.274858 -0.421113 0.455781
C  -0.011276 -1.226566 2.33205
C  1.240379 -1.119099 1.684325
C  3.749413 -0.62606 -0.027459
C  4.683036 -0.212971 -1.153685
C  6.163052 -0.530942 -0.862487
C  7.076836 -0.128829 -2.038737
H  -2.004431 1.641601 -2.071892
H  -1.712388 -0.121275 -2.027704
H  -4.483434 0.717326 0.640715
H  -3.681437 -0.839347 0.990645
H  -3.297684 2.677971 -0.107835
H  -1.526402 2.706909 0.069455
H  -3.946969 -0.03756 -3.064362
H  -4.454181 1.302463 -1.99258
H  -3.490871 1.873144 2.308358
H  -1.725545 1.976369 2.460061
H  -4.338663 -2.635501 -0.5010
H  -2.82831 -2.155405 -1.344464
H  -4.374531 -2.303227 -2.252726
H  0.209091 0.67354 -1.059493
H  -2.125299 -0.767003 2.324948
H  -2.810438 4.059668 3.378135
H  -1.828561 4.470138 1.943037
H  -3.606156 4.362268 1.806352
H  -0.065871 -1.756095 3.289816
H  2.143683 -1.551181 2.114085
H  4.346075 -0.725121 -2.077296
H  4.536956 0.867805 -1.345142
H  6.268781 -1.610464 -0.647747
H  6.47491 -0.004755 0.059125
H  8.13392 -0.360364 -1.816002
H  7.007161 0.955048 -2.250142
H  6.801598 -0.670126 -2.963722
