program: Gaussian 09
title: 000200272
version: EM64L-G09RevD.01
frameworkgroup: C1[X(C19H22ClN3O)]
method: RPBEPBE
basis: SDD
operation: Freq
keyword: #p
keyword: freq=noraman
keyword: PBEPBE/SDD
title: #p freq=noraman PBEPBE/SDD
converged: YES YES NO NO
title: Mulliken charges:
elementType: Cl O N N N C C C C C C C C C C C C C C C C C C C H H H H H H H H H H H H H H H H H H H H H H
charge: -0.067897 -0.255993 -0.214719 -0.101549 -0.080064 0.376124 0.019083 -0.415193 -0.553930 0.104404 -0.331090 -0.267340 -0.316272 0.476007 -0.336016 -0.060998 -0.248884 -0.624888 -0.614784 -0.358267 -0.439012 -0.221031 -0.214633 -0.240785 0.220192 0.231997 0.226780 0.257978 0.171913 0.206458 0.215222 0.219491 0.276880 0.260476 0.253998 0.184478 0.221128 0.235974 0.225604 0.186203 0.223012 0.251591 0.230841 0.228220 0.228490 0.230800
chargesum: 0.00000
title: Mulliken charges with hydrogens summed into heavy atoms:
elementType: Cl O N N N C C C C C C C C C C C C C C C C C C C
charge: -0.067897 -0.255993 -0.214719 -0.101549 -0.080064 0.376124 0.019083 0.036995 -0.069171 0.104404 0.047281 0.167373 -0.039392 0.476007 -0.075540 -0.060998 0.005113 0.016693 0.020035 -0.106676 -0.208171 0.007189 0.013857 -0.009985
polarizability: 3.20421281e+02 4.00054218e+00 2.31783802e+02 -3.42993070e+00 1.06500608e+01 1.72362184e+02
1716.lowfreq: -16.4238 -3.8064 -1.5213 0.0017 0.0018 0.0020 6.0616 10.8893 19.4733
frequency: -14.7836 10.8153 19.4169 27.1241 35.9109 38.8643 65.5901 100.8153 104.1991 120.3655 134.6017 139.1046 151.1552 176.8053 213.0500 219.1525 226.2893 236.2892 266.9614 276.7354 302.0729 316.7056 338.3420 341.2248 387.0060 403.8521 407.2507 425.4706 438.7486 457.5248 482.2360 543.0161 562.3885 583.5682 600.2665 615.6997 627.6171 663.7393 696.4220 709.3751 736.9752 751.7618 771.3481 773.8805 799.3671 808.8803 809.3335 837.1782 844.0290 856.2673 869.4918 908.0465 930.8668 949.7743 955.0096 979.7641 989.8754 999.2458 1022.2185 1025.9395 1030.2263 1032.7229 1050.8433 1069.7723 1074.7005 1083.9128 1091.5463 1092.7661 1098.4836 1141.9621 1143.3601 1171.1764 1173.0855 1173.8091 1187.1344 1206.6621 1220.5045 1245.5716 1258.6153 1268.9573 1283.4262 1288.6015 1299.4941 1311.4351 1325.1448 1347.5339 1359.1260 1376.2126 1380.0018 1389.0975 1403.5639 1418.1571 1427.6927 1441.8252 1444.2134 1454.3410 1460.3695 1461.4308 1471.0271 1473.4066 1474.3290 1477.8966 1483.9094 1484.7386 1491.0298 1512.4670 1575.7793 1597.1193 1615.2184 1623.4724 2811.7337 2840.6879 2857.8175 2980.4604 2990.5049 2999.4188 3012.9126 3019.1176 3032.3908 3037.2784 3060.8022 3077.7484 3081.9846 3090.2633 3112.5298 3124.9036 3136.2151 3147.7916 3159.4784 3164.5995 3179.1284 3182.1919
redmass: 2.7213 4.9841 4.8164 3.9444 5.9636 4.8142 4.2147 1.7688 3.9677 4.4326 4.6874 3.0075 4.1245 5.3450 4.9091 1.1478 1.2867 4.8775 3.4727 6.4118 2.5978 3.6961 3.5524 3.1553 8.6658 2.8409 4.1523 2.9346 2.5467 3.1470 3.1322 5.6001 5.3321 5.9994 6.0303 6.1518 5.7190 6.6105 4.8610 1.8753 4.2117 2.0302 1.3566 3.1075 3.9519 3.9742 1.5340 5.2989 1.4700 1.2495 1.2158 1.5230 6.3030 2.3991 1.3288 1.3890 6.2503 1.3292 2.5302 2.2448 2.8894 1.6760 2.4741 2.4961 2.2556 2.5205 1.6370 1.5527 1.6048 1.5409 1.3605 2.4737 1.1700 1.6014 1.1137 2.8208 1.7834 1.3510 2.1089 1.2537 1.5645 1.2607 1.3548 1.6405 2.7903 1.5303 1.5580 2.9403 1.6611 4.2734 4.0517 1.1466 4.2368 1.1660 2.1061 1.3885 1.0597 1.0617 2.2342 1.0981 1.2030 1.0613 1.1355 1.9644 1.1167 5.1528 8.3440 6.1326 6.0546 8.2849 1.0704 1.0577 1.0576 1.0568 1.0638 1.0844 1.0610 1.0718 1.0715 1.1060 1.0975 1.1015 1.1044 1.1005 1.0881 1.0860 1.0910 1.0960 1.0887 1.1015 1.0940 1.0969
irintensity: 0.3697 0.0316 0.3315 0.0433 0.1301 0.1300 0.3226 0.2481 0.6669 0.0978 0.3223 7.6380 0.5411 0.3214 2.4978 1.0471 0.8253 0.6966 1.2016 0.6356 2.6804 10.2769 3.8705 8.6124 1.7412 0.3150 2.2060 7.9701 0.2526 12.9282 8.0164 2.4198 6.7051 2.6460 6.0043 1.5353 10.7562 26.4229 19.9029 80.4777 5.2713 23.5473 4.5492 13.1756 8.4572 8.2651 48.8859 56.6828 26.5360 0.1411 0.4530 7.6133 59.3619 12.3826 0.2842 0.0228 0.7709 1.2891 20.5919 8.7188 65.2986 6.8186 84.2281 1.0340 17.3823 36.2814 16.6382 14.5379 2.1782 5.3320 35.4460 43.9293 1.9160 16.1205 1.9692 5.0015 6.8383 18.9688 5.3437 0.0810 9.9994 2.2263 4.9791 26.5629 18.1272 27.6954 162.8154 5.6340 73.0462 5.1481 63.5560 3.1467 77.0597 3.7912 20.9715 24.8816 9.0969 17.5073 10.1005 5.3936 13.2066 10.4557 2.5204 5.1015 53.5162 233.9087 5.9198 1.6075 5.8234 123.0956 78.8157 72.4881 224.6543 19.8868 36.8901 18.6236 25.8059 46.9605 44.5551 12.8941 1.9463 22.6017 59.8285 46.9383 9.7423 0.9063 10.1142 34.6589 0.8479 23.6615 1.7792 3.0559
temp: 298.150 k
press: 1.00000 atm
elementType: 17 8 7 7 7 6 6 6 6 6 6 6 6 6 6 6 6 6 6 6 6 6 6 6 1 1 1 1 1 1 1 1 1 1 1 1 1 1 1 1 1 1 1 1 1 1
symmnumber: 1
zpe: 975870.8 jmol-1
zpe.correction: 0.371690 hartree
zpe.thermalcorrener: 0.394264 hartree
zpe.thermalcorrenthalpy: 0.395208 hartree
zpe.thermalcorrgfe: 0.315940 hartree
zpe.sumelectzpe: -1434.960805 hartree
zpe.sumelectthermal: -1434.938231 hartree
zpe.sumelectthermalent: -1434.937287 hartree
zpe.sumelectthermalfe: -1435.016554 hartree
dipole: -1.3593 -3.0096 0.0070
dipole: 3.3023
quadrupole: -137.5370 -150.3612 -143.6207
quadrupole: -6.1203 -6.7891 1.4738
quadrupole: 6.3026 -6.5215 0.2189 -6.1203 -6.7891 1.4738
hfenergy: -1435.3324944 hartree
pointgroup: C01 [X(C19H22Cl1N3O1)]
dipole: 0.5415942 1.1694325 -0.1646751 debye
polarizability: 320.5400758|3.1111865|227.9650375|-0.899801|-18.0523804|176.0621529 unknown
InChI: InChI=1S/C19H22ClN3O/c1-22(2)11-6-12-24-19-17-10-9-16(20)13-18(17)23(21-19)14-15-7-4-3-5-8-15/h3-5,7-10,13H,6,11-12,14H2,1-2H3
charge 0 multiplicity 1
46 atoms
Cl -4.555913 -3.454887 0.849024
O  2.048309 -1.020159 0.1692
N  -1.095101 0.214102 -0.873598
N  0.312483 0.344099 -0.794833
N  6.882409 -0.023982 -0.08867
C  -1.535113 -0.945526 -0.25271
C  -0.368224 -1.617568 0.251271
C  4.413788 -0.512801 0.097385
C  -1.872132 1.250293 -1.556464
C  0.727596 -0.758255 -0.121172
C  5.511923 0.483601 -0.333403
C  3.031744 -0.024722 -0.33648
C  -2.838104 -1.479846 -0.085034
C  -2.769733 2.069334 -0.628596
C  -0.493097 -2.85284 0.932388
C  -2.909473 -2.703159 0.593217
C  -1.776744 -3.40109 1.103192
C  7.198269 -0.185704 1.345538
C  7.898705 0.796835 -0.779875
C  -2.279478 2.550854 0.61122
C  -4.093501 2.386726 -1.016779
C  -3.101832 3.337081 1.446715
C  -4.916867 3.179618 -0.183956
C  -4.422652 3.656337 1.051036
H  4.407702 -0.647254 1.194389
H  4.624996 -1.496813 -0.358343
H  -2.481967 0.789886 -2.358063
H  -1.123144 1.90018 -2.042454
H  5.339471 1.470645 0.176592
H  5.418944 0.66761 -1.422333
H  2.783023 0.967146 0.089709
H  2.934704 0.039467 -1.437879
H  -3.735078 -0.970124 -0.443685
H  0.390786 -3.370367 1.316289
H  -1.918966 -4.352454 1.622246
H  7.132357 0.774631 1.920257
H  8.225421 -0.577511 1.451178
H  6.513801 -0.913268 1.812619
H  7.6832 0.822753 -1.863094
H  7.946004 1.853906 -0.410766
H  8.896947 0.344302 -0.641784
H  -1.257358 2.301614 0.91984
H  -4.484418 2.013776 -1.972393
H  -2.715268 3.701232 2.405264
H  -5.940476 3.417107 -0.494543
H  -5.060244 4.26569 1.701137
