program: Gaussian 09
title: 000200164
version: EM64L-G09RevD.01
frameworkgroup: C1[X(C6H8O4)]
method: RPBEPBE
basis: SDD
operation: Freq
keyword: #p
keyword: freq=noraman
keyword: PBEPBE/SDD
title: #p freq=noraman PBEPBE/SDD
converged: YES YES NO NO
title: Mulliken charges:
elementType: O O O O C C C C C C H H H H H H H H
charge: -0.461369 -0.461374 -0.437519 -0.437563 -0.361327 -0.361598 -0.489668 -0.489491 0.052825 0.052809 0.157852 0.199476 0.157854 0.199517 0.165092 0.174696 0.174711 0.165076
chargesum: -2.00000
title: Mulliken charges with hydrogens summed into heavy atoms:
elementType: O O O O C C C C C C
charge: -0.461369 -0.461374 -0.437519 -0.437563 -0.003998 -0.004227 -0.149880 -0.149704 0.052825 0.052809
polarizability: 1.03930867e+02 -3.36155554e+00 7.54510544e+01 -2.66471061e-03 -2.15384309e-03 6.41888362e+01
1716.lowfreq: 0.0009 0.0010 0.0011 4.2825 5.1297 13.1712 25.7509 42.5715 47.9951
frequency: 25.6925 42.5553 47.9905 81.4932 112.0631 112.4047 172.2385 258.8318 319.2881 448.7310 449.7225 554.9574 588.5764 649.4555 668.2955 714.0575 773.8249 841.0548 852.8378 879.1341 1024.3610 1030.0874 1049.8372 1073.0418 1084.7168 1173.4272 1215.3800 1229.5005 1249.3671 1258.5808 1260.6629 1269.5379 1295.2123 1318.0675 1436.6865 1439.8047 1458.0208 1475.6331 1527.5862 1528.8335 2929.9366 2931.6219 2945.9092 2951.1918 2993.9994 2999.2435 3015.8458 3038.7672
redmass: 15.0934 2.6684 5.6714 6.3649 2.0310 2.3795 8.0513 6.5969 4.8070 3.3979 3.9842 3.5043 3.4239 5.7994 4.3147 1.1497 1.5135 6.3482 5.5038 1.5430 2.5578 3.7203 1.9577 2.3506 1.3374 1.2816 1.4384 1.4559 1.6311 1.6173 2.3979 2.9415 1.4591 1.6608 1.0870 1.0880 1.0783 1.0967 9.2105 9.0198 1.0641 1.0642 1.0625 1.0659 1.0879 1.0928 1.0978 1.1011
irintensity: 0.0618 3.4418 19.2735 11.5274 0.4583 1.7634 1.2192 0.6068 9.2628 0.0695 19.5353 19.1101 0.9627 2.2500 14.7680 8.5640 4.2581 51.7020 0.0072 1.5498 0.4697 1.6977 5.7376 0.0296 0.8640 15.5475 18.2336 0.8152 224.7630 1.7733 271.9191 1.7008 15.6416 1.0511 10.0309 1.2624 0.0088 14.2637 498.4695 226.3068 37.9140 6.8451 13.2084 149.6633 1.3618 25.3853 10.7549 189.8188
temp: 298.150 k
press: 1.00000 atm
elementType: 8 8 8 8 6 6 6 6 6 6 1 1 1 1 1 1 1 1
symmnumber: 1
zpe: 345709.2 jmol-1
zpe.correction: 0.131674 hartree
zpe.thermalcorrener: 0.142586 hartree
zpe.thermalcorrenthalpy: 0.143531 hartree
zpe.thermalcorrgfe: 0.092009 hartree
zpe.sumelectzpe: -533.591423 hartree
zpe.sumelectthermal: -533.580510 hartree
zpe.sumelectthermalent: -533.579566 hartree
zpe.sumelectthermalfe: -533.631087 hartree
dipole: 0.0013 -0.0038 -0.5848
dipole: 0.5848
quadrupole: -221.0801 -74.7674 -67.8497
quadrupole: -5.9283 0.0027 0.0015
quadrupole: -99.8477 46.4650 53.3827 -5.9283 0.0027 0.0015
hfenergy: -533.7230966 hartree
pointgroup: C01[X(C6H8O4)]
dipole: 0.0006879 0.0095814 0.2298804 debye
dipolederiv: -1.293779 -0.2914847 -0.2711816 -0.1722223 -0.8284205 -0.2259181 -0.2619475 -0.2440151 -0.6941258 -1.2924023 -0.2715184 0.2918072 -0.153168 -0.795042 0.2334738 0.2741759 0.2517551 -0.7287399 -0.8750718 0.1361303 0.0561736 0.0157483 -1.0812555 -0.3755186 -0.0421544 -0.3695487 -0.716737 -0.8752495 0.1326751 -0.065724 0.019547 -1.0270827 0.397311 0.040746 0.3912502 -0.7708698 -0.0258587 -0.0192645 -0.0119845 -0.0127272 0.0507757 -0.0338803 0.0259775 -0.0449597 0.1761844 -0.0263116 -0.0183058 0.0136677 -0.0143753 0.0567669 0.0423206 -0.0247158 0.05331 0.1702046 -0.4410073 0.1499003 0.0086811 0.2753191 0.0097705 -0.0625875 0.0083297 -0.0723559 0.2234785 -0.4412661 0.1486927 -0.0181969 0.2735271 0.0204825 0.0762435 -0.0265862 0.0862818 0.2130329 1.4726921 0.0103414 0.2254122 -0.073778 1.0741109 0.6529674 0.281365 0.6587525 0.4644365 1.4717096 -0.0064493 -0.226638 -0.0944329 0.9789523 -0.6892086 -0.276479 -0.6951889 0.5604045 0.0184279 -0.0133756 0.0056531 0.0003604 -0.0687792 0.1447618 -0.0072269 0.1603671 -0.133398 0.0960415 -0.0002448 -0.0060508 -0.0102978 -0.0345743 -0.1134345 -0.0173481 -0.1244909 -0.0836991 0.0184257 -0.0140573 -0.0049665 0.0005735 -0.0901863 -0.1477957 0.0069342 -0.1634281 -0.1120893 0.0962956 0.0005681 0.0055824 -0.0087159 -0.0184093 0.1088241 0.0176401 0.1199746 -0.0998641 0.0346873 0.0210552 -0.0228268 -0.0029591 -0.0723491 0.1242722 -0.023888 0.1674674 -0.108342 0.01397 0.0070055 0.0214771 -0.0195132 -0.0510483 -0.1326206 0.0360345 -0.1600375 -0.1260265 0.013874 0.0057062 -0.0221999 -0.0217475 -0.0311081 0.1260278 -0.0349515 0.153373 -0.145844 0.0348227 0.0226256 0.0213145 -0.0011381 -0.0926033 -0.1252383 0.0240946 -0.1685068 -0.088006 unknown
polarizability: 103.9503227|3.2749109|75.4174125|-0.144146|-0.398847|64.2030228 unknown
InChI: InChI=1S/C6H8O4/c7-5(8)3-1-2-4-6(9)10/h1-4H2
charge -2 multiplicity 1
18 atoms
O  4.294904 0.627063 0.509471
O  -4.291765 -0.586717 0.55926
O  3.410794 -1.13048 -0.757483
O  -3.411194 1.077899 -0.829807
C  0.695024 -0.343101 0.036294
C  -0.693338 0.350272 0.013887
C  1.894238 0.633885 0.048724
C  -1.891896 -0.624285 0.095967
C  3.319653 -0.025763 -0.068758
C  -3.318013 0.024468 -0.065169
H  0.762967 -1.008349 0.924647
H  0.810643 -1.009102 -0.841932
H  -0.759585 1.075187 0.854344
H  -0.811357 0.953786 -0.908078
H  1.789654 1.332359 -0.812741
H  1.882174 1.264121 0.960887
H  -1.878238 -1.189554 1.049743
H  -1.787363 -1.380691 -0.715054
