program: Gaussian 09
title: 000200287
version: EM64L-G09RevD.01
frameworkgroup: C1[X(C21H32FNO2)]
method: RPBEPBE
basis: SDD
operation: Freq
keyword: #p
keyword: freq=noraman
keyword: PBEPBE/SDD
title: #p freq=noraman PBEPBE/SDD
converged: YES YES NO NO
title: Mulliken charges:
elementType: F O O N C C C C C C C C C C C C C C C C C C C C C H H H H H H H H H H H H H H H H H H H H H H H H H H H H H H H H
charge: -0.246072 -0.297493 -0.248305 -0.058008 0.248933 -0.505403 -0.540357 -0.383920 -0.392293 -0.345590 0.439021 -0.400273 -0.370769 -0.386819 -0.372499 -0.372499 0.305834 -0.381642 -0.248183 -0.253446 -0.494218 -0.240447 -0.399006 -0.664255 -0.215332 0.210238 0.231337 0.226973 0.253629 0.211498 0.195933 0.196704 0.211206 0.203737 0.174484 0.212204 0.201596 0.191182 0.189879 0.239431 0.238123 0.199063 0.196312 0.194678 0.194908 0.224547 0.225261 0.238815 0.238400 0.228654 0.216551 0.217056 0.221327 0.213603 0.238076 0.193831 0.193805
chargesum: 0.00000
title: Mulliken charges with hydrogens summed into heavy atoms:
elementType: F O O N C C C C C C C C C C C C C C C C C C C C C
charge: -0.246072 -0.297493 -0.248305 -0.058008 0.248933 -0.063828 -0.059755 0.023511 0.015617 0.032630 0.439021 0.013527 0.010292 -0.147388 -0.134376 0.022876 0.305834 0.007945 -0.023636 -0.028186 -0.017003 -0.011793 0.034601 0.008751 0.172305
polarizability: 2.81199334e+02 -1.04162976e+01 2.24324651e+02 -4.73528410e+00 -7.59942495e+00 2.05673812e+02
1716.lowfreq: -9.2318 -6.0451 -0.0011 0.0009 0.0015 1.4736 12.1779 21.0229 35.3222
frequency: 10.2147 20.9833 35.3135 37.2219 39.3511 47.1792 58.5196 61.6223 74.6522 83.4849 90.4499 100.6005 109.9985 140.4876 143.6886 144.7182 160.6121 164.1284 198.4124 203.9595 228.6820 237.9330 257.4550 269.3836 300.0452 307.7959 334.0036 334.9633 362.7192 390.8136 403.6063 431.0065 454.6377 469.5178 491.8199 509.8641 521.4440 558.1686 567.1610 616.6186 632.5603 662.4698 694.1058 702.7686 725.8159 744.5856 762.5882 767.8519 779.9927 794.0906 816.9523 826.7005 832.0479 849.8843 857.1201 908.2553 913.0773 928.9089 932.2469 951.2683 975.5093 988.9356 991.8045 996.0055 999.3160 1008.2357 1012.9478 1016.0067 1024.9822 1027.1725 1040.1720 1064.7505 1066.2412 1074.5863 1080.7258 1082.6143 1085.1636 1093.7669 1102.2022 1119.1682 1125.3684 1139.7182 1143.8604 1151.8753 1173.4826 1179.4526 1185.2939 1196.8259 1199.5400 1215.7394 1227.2696 1244.4500 1253.2658 1261.3729 1275.1911 1278.3306 1282.4886 1291.2838 1297.3871 1301.6489 1313.7668 1315.5014 1318.5319 1326.9130 1333.6225 1340.0432 1344.3473 1353.5556 1362.1860 1372.3356 1380.2415 1385.6954 1394.3807 1398.6969 1435.4085 1444.9740 1458.8798 1460.2109 1463.1106 1465.7880 1471.3543 1471.7057 1472.4068 1472.8355 1478.8795 1481.3333 1483.7024 1487.0576 1488.3391 1490.8714 1591.0650 1612.7765 1639.0318 2828.3702 2844.3799 2856.4209 2953.1354 2955.8043 2965.4983 2978.4792 2989.8833 2990.4621 2992.9045 2997.5951 3000.8959 3001.2707 3003.3694 3014.8006 3017.3657 3028.3321 3031.7038 3042.6838 3047.0342 3051.7297 3052.0594 3078.8443 3081.5975 3091.6147 3092.8669 3103.9710 3122.2339 3130.9467 3144.0818 3157.3554 3170.3175
redmass: 5.3880 5.3963 3.5969 2.6454 2.0939 3.9797 2.4296 3.8639 6.4952 1.9005 3.4032 3.9248 3.2246 1.9672 2.4347 5.6574 3.2461 2.8215 1.5262 2.3892 3.4888 3.3071 5.0377 3.0237 4.3340 4.6701 2.5031 3.0355 2.2278 3.6858 2.8229 3.2874 3.2417 3.3688 3.5113 3.3748 2.7341 2.8122 3.6890 6.3502 3.3642 3.8358 5.3720 1.6241 1.0675 1.0973 3.3685 2.1153 1.1432 1.3657 1.5840 3.5118 1.2197 1.2621 3.2697 1.5568 1.5321 8.1187 2.0789 2.0468 1.3944 3.1471 3.7885 1.5191 1.3146 3.1928 1.9280 3.2420 1.7141 2.4107 2.3929 2.9602 2.9184 2.3110 2.1507 1.8286 1.7141 2.2853 3.3510 2.7172 2.8592 2.8532 1.8426 1.3674 1.0652 1.4139 1.3821 1.1739 1.9254 1.3622 1.5495 1.1820 1.3840 1.2944 1.3391 1.1949 1.1440 1.1968 1.1280 1.2567 1.6888 1.4143 1.3326 1.4070 1.6704 1.3836 1.3788 1.4503 1.6370 1.4343 6.8406 1.3077 1.4387 1.2122 2.2011 1.0849 1.0890 1.0869 1.0700 1.0822 1.0828 1.0793 1.0404 1.0951 1.1484 1.3007 1.0511 1.1861 1.4045 1.1010 5.9949 6.0460 9.7461 1.0704 1.0716 1.0695 1.0588 1.0587 1.0592 1.0614 1.0633 1.0968 1.0594 1.0371 1.0910 1.0565 1.0949 1.0651 1.0660 1.1030 1.0820 1.0888 1.1029 1.0953 1.1031 1.1102 1.1024 1.0989 1.1005 1.1000 1.0845 1.0879 1.0935 1.0967 1.0981
irintensity: 0.2262 0.4825 0.6467 0.5703 0.9844 0.4925 0.9176 1.2198 3.5974 1.0756 1.0547 1.0659 1.4925 0.0512 0.8698 0.1031 0.9824 1.7743 0.7361 1.5878 2.0016 0.9119 5.1583 1.0309 6.9673 10.8985 2.3359 4.7694 2.4899 2.0570 0.0951 4.2037 6.9318 0.7315 1.7492 4.7439 0.7441 6.0402 14.6291 0.0488 4.6038 1.6011 4.2513 56.8794 11.1242 0.1621 10.4586 62.7515 3.0224 13.7097 1.4452 10.7547 1.2184 0.6862 35.4427 15.7178 8.8965 67.6860 8.2901 4.8884 0.5492 56.8460 0.5252 0.2122 2.4921 0.7403 72.7385 34.1915 3.9182 11.0659 45.1582 2.4824 26.3366 62.0029 0.0560 1.6354 6.5688 19.6488 16.2814 22.4318 88.5195 167.9608 33.1046 2.2243 0.3367 10.4703 11.2231 3.7953 13.6866 4.7848 10.5560 3.6722 4.0176 4.3777 5.7318 1.7009 0.0916 5.2610 0.6523 20.7736 23.8613 11.5544 0.2028 4.8959 61.6474 9.0349 8.2040 0.8329 0.3321 4.5476 0.2686 16.6210 5.8368 19.7545 8.4451 22.6947 12.9304 5.7198 0.3084 1.0717 2.3329 0.4589 12.7860 4.3124 10.2559 14.8055 14.8590 1.4413 4.2813 24.4057 1.6699 0.6514 122.6695 56.3233 31.3396 167.3315 7.0350 3.1500 55.5196 40.1916 17.5983 3.5589 3.5573 28.8860 7.0062 90.2498 13.4422 4.0206 18.4512 25.1090 38.4734 57.6896 4.6477 3.6770 105.8602 97.7036 28.4111 14.1974 33.8911 28.8326 1.6973 3.4443 28.9931 38.5534 8.3911
temp: 298.150 k
press: 1.00000 atm
elementType: 9 8 8 7 6 6 6 6 6 6 6 6 6 6 6 6 6 6 6 6 6 6 6 6 6 1 1 1 1 1 1 1 1 1 1 1 1 1 1 1 1 1 1 1 1 1 1 1 1 1 1 1 1 1 1 1 1
symmnumber: 1
zpe: 1288726.4 jmol-1
zpe.correction: 0.490850 hartree
zpe.thermalcorrener: 0.517913 hartree
zpe.thermalcorrenthalpy: 0.518857 hartree
zpe.thermalcorrgfe: 0.429084 hartree
zpe.sumelectzpe: -1122.524058 hartree
zpe.sumelectthermal: -1122.496996 hartree
zpe.sumelectthermalent: -1122.496052 hartree
zpe.sumelectthermalfe: -1122.585824 hartree
dipole: -1.7727 2.2457 2.1054
dipole: 3.5522
quadrupole: -186.9944 -147.0619 -150.2448
quadrupole: 11.5297 -0.2779 -4.0613
quadrupole: -25.5607 14.3718 11.1889 11.5297 -0.2779 -4.0613
hfenergy: -1123.0149085 hartree
pointgroup: C01 [X(C21H32F1N1O2)]
dipole: 0.715548 0.8617912 -0.8357505 debye
polarizability: 281.4701888|9.800045|224.4693177|-3.8223716|7.3982375|205.2582907 unknown
InChI: InChI=1S/C21H32FNO2/c1-2-20(24)25-21(19-11-7-6-8-12-19)13-17-23(18-14-21)16-10-5-3-4-9-15-22/h6-8,11-12H,2-5,9-10,13-18H2,1H3
charge 0 multiplicity 1
57 atoms
F  -10.557734 -0.791466 0.69747
O  3.444241 -1.371021 -0.705846
O  4.066298 -1.560607 1.549063
N  -0.582741 -0.022078 -0.883638
C  2.350808 -0.331728 -0.423804
C  1.714342 -0.156128 -1.824241
C  1.283895 -0.950406 0.509848
C  0.409166 0.658276 -1.754629
C  -0.047465 -0.164467 0.493145
C  -1.907093 0.648195 -0.921128
C  3.043352 0.94679 0.080296
C  -3.05556 -0.225107 -0.374663
C  -4.434114 0.454355 -0.538285
C  3.997248 1.586125 -0.756403
C  2.794055 1.505201 1.357762
C  -5.599663 -0.411115 -0.009829
C  4.235581 -1.849814 0.343174
C  -6.97878 0.268311 -0.167273
C  4.6683 2.753936 -0.337148
C  3.45818 2.678381 1.779386
C  5.331144 -2.752074 -0.212483
C  4.395331 3.311768 0.93342
C  -8.141493 -0.611234 0.352614
C  6.000589 -3.615889 0.871874
C  -9.491177 0.082993 0.192175
H  2.423586 0.328249 -2.517133
H  1.485375 -1.161734 -2.219762
H  1.083175 -1.972185 0.137576
H  1.662218 -1.042026 1.540501
H  -0.018464 0.740489 -2.770995
H  0.628871 1.69901 -1.400932
H  0.091059 0.840632 0.96884
H  -0.780313 -0.716334 1.107557
H  -2.125564 0.887029 -1.980887
H  -1.889059 1.62569 -0.368923
H  -3.042599 -1.193765 -0.911137
H  -2.893978 -0.451237 0.698094
H  -4.43182 1.429796 -0.007856
H  -4.606835 0.683178 -1.61096
H  4.233544 1.154617 -1.735472
H  2.099595 1.0153 2.045635
H  -5.606768 -1.383252 -0.544512
H  -5.42777 -0.645932 1.061113
H  -6.971675 1.236744 0.375358
H  -7.145302 0.511335 -1.23764
H  5.40436 3.226401 -0.997544
H  3.251693 3.090082 2.773716
H  4.900797 -3.368022 -1.022724
H  6.078135 -2.092586 -0.698979
H  4.913044 4.219947 1.261912
H  -7.983652 -0.851459 1.421648
H  -8.16181 -1.572096 -0.196644
H  5.28092 -4.324899 1.317208
H  6.836465 -4.194744 0.440738
H  6.390992 -2.984988 1.688068
H  -9.547624 1.019198 0.779259
H  -9.728309 0.287363 -0.869182
