program: Gaussian 09
title: 000200224
version: EM64L-G09RevD.01
frameworkgroup: C1[X(C21H28O2)]
method: RPBEPBE
basis: SDD
operation: Freq
keyword: #pfreq=noraman
keyword: PBEPBE/SDD
title: #p freq=noraman PBEPBE/SDD
converged: YES YES NO NO
title: Mulliken charges:
elementType: O O C C C C C C C C C C C C C C C C C C C C C H H H H H H H H H H H H H H H H H H H H H H H H H H H H
charge: -0.450118 -0.236087 -0.119465 0.347797 -0.168279 -0.098233 -0.549781 0.048450 -0.565023 -0.515626 -0.073789 -0.228313 -0.499678 -0.680897 -0.828521 0.538500 -0.466244 -0.763265 0.227132 -0.541273 -0.580802 0.178167 -0.553016 0.258059 0.224424 0.235168 0.208295 0.217379 0.216821 0.231169 0.209992 0.222868 0.221687 0.227708 0.238883 0.243899 0.221651 0.237618 0.223278 0.233915 0.238539 0.214113 0.221752 0.228372 0.233334 0.214292 0.342540 0.242927 0.224820 0.257739 0.287129
chargesum: 0.00000
title: Mulliken charges with hydrogens summed into heavy atoms:
elementType: O O C C C C C C C C C C C C C C C C C C C C C
charge: -0.107578 -0.236087 0.138594 0.347797 0.056144 0.136935 -0.124107 0.048450 -0.117034 -0.082767 0.147898 -0.000605 -0.016896 -0.221629 -0.132790 0.538500 -0.030379 -0.087267 0.227132 -0.073527 -0.323064 0.178167 -0.265887
polarizability: 3.02696623e+02 -9.27889417e+00 2.07622740e+02 -1.56185706e+01 8.63569724e-02 1.63235444e+02
1716.lowfreq: -9.7160 -0.0005 0.0003 0.0006 9.1254 11.7041 33.2976 47.0640 66.2948
frequency: 33.0797 47.0209 66.2664 84.7710 93.7161 126.1907 143.2558 163.1266 172.8005 184.1806 186.6745 205.5940 208.3666 226.5271 247.8591 264.6565 278.5784 310.7940 314.4313 329.3805 340.9347 353.1342 385.2444 390.3715 406.4162 413.9760 432.2094 438.7296 469.0072 471.3449 485.6927 511.8770 519.9851 533.7383 569.5509 597.5752 609.8545 618.9882 634.7955 642.1050 659.4390 690.2412 723.0383 759.5666 789.2536 801.5335 816.9549 825.2825 850.7828 871.3223 887.5303 892.2903 909.4914 918.4600 937.6164 955.3320 962.8212 971.7644 986.2177 1001.1165 1008.9682 1016.9281 1030.8332 1032.0289 1046.7458 1054.1665 1065.9953 1081.9735 1086.5637 1100.3554 1113.7695 1123.8840 1140.9115 1147.8889 1153.1521 1165.6335 1176.8302 1190.9492 1203.1064 1212.8933 1219.9834 1221.6160 1230.3864 1253.1546 1256.0728 1268.5383 1271.6272 1277.2430 1282.2032 1290.9693 1292.7609 1309.4108 1319.3633 1321.3227 1325.3688 1333.0630 1335.6270 1340.9801 1346.5977 1349.2308 1356.9046 1364.4552 1373.9715 1392.2704 1395.3513 1441.5802 1448.6285 1459.1734 1464.3633 1468.0106 1472.8386 1477.1171 1479.4938 1482.2733 1490.9398 1495.6749 1586.7927 1629.2610 2127.8613 2898.2703 2929.2204 2940.7974 2955.3464 2965.6464 2969.5080 2971.9722 2975.0057 2978.8467 2980.0112 2983.3717 2992.8153 2996.2875 3023.7280 3030.5581 3031.6346 3038.5141 3050.5672 3054.1121 3063.8521 3069.5303 3079.8870 3082.3415 3092.4728 3097.0495 3120.1628 3427.3136 3551.7380
redmass: 6.4287 3.5916 4.4128 3.8144 3.6097 2.0576 4.4323 3.1674 2.7532 2.5420 2.6238 1.9479 1.3414 2.3844 2.3804 2.4980 3.0165 1.8285 1.9393 2.3099 2.8053 2.3226 3.4764 2.4308 2.8175 3.3265 3.7535 3.5738 3.3330 4.0567 4.0235 3.7162 2.5659 3.0210 4.5355 3.9938 2.8674 3.4694 1.3800 2.8284 1.2512 2.4814 3.2009 2.3753 1.9374 2.8484 2.3886 1.9477 2.1882 2.0520 1.9700 2.1666 1.6254 1.7748 2.4344 1.9570 2.1219 2.1872 2.0384 2.6046 2.0159 2.4234 2.3574 1.9788 2.1510 1.9936 1.8646 1.9877 2.1304 2.4283 1.6265 2.3132 1.6535 2.1155 1.8755 1.7927 1.6922 1.8410 1.5437 1.5528 1.5322 1.4852 1.3833 1.3968 1.6167 1.6462 1.4337 1.6158 1.3546 1.5235 1.4335 1.4085 1.5939 1.4611 1.4466 1.3379 1.3697 1.4760 1.6662 1.6130 1.4920 1.5720 1.5078 1.2007 1.2151 1.0826 1.0926 1.0703 1.0783 1.0876 1.0808 1.0708 1.0484 1.0540 1.0628 1.0755 9.8774 7.7450 6.0813 1.0793 1.0795 1.0655 1.0813 1.0588 1.0674 1.0751 1.0706 1.0626 1.0772 1.0422 1.0421 1.0579 1.0987 1.0944 1.0621 1.1004 1.0972 1.1006 1.0953 1.0985 1.0988 1.0986 1.0974 1.1039 1.0914 1.1582 1.0660
irintensity: 2.9016 0.5491 1.2454 0.5237 0.6520 0.2708 1.3871 1.6679 0.2597 1.2905 1.5300 0.6398 1.1116 1.1556 2.6060 0.1084 0.9808 45.9471 46.1161 44.9464 4.3665 12.6162 1.8653 17.5369 31.6746 6.2907 2.4794 10.0456 1.7974 3.0504 2.4480 2.6821 1.8486 0.5737 6.1149 1.5348 3.7513 5.0028 55.5113 13.4828 57.4754 8.7756 1.7542 5.5402 8.4063 0.8612 1.4623 0.6616 6.0663 11.9323 2.4502 4.3259 40.0676 4.9944 19.7086 13.2087 8.4604 12.5488 8.8549 9.8328 15.0260 11.5929 29.4910 4.6573 2.4476 3.3046 6.2261 5.2357 10.4246 1.6048 8.9895 3.5270 3.2456 4.5707 1.2196 0.6858 2.4881 3.6910 19.8597 19.2527 3.9321 5.9868 4.3733 4.5538 13.7081 49.3114 32.9202 3.9495 10.1958 3.1680 10.8932 2.3096 19.0119 8.3523 2.3647 1.9146 3.4566 2.2334 7.8893 7.5347 1.3519 2.4496 1.6819 1.4644 47.9433 13.9284 14.2288 3.4514 7.0672 8.7662 8.8578 10.2878 9.4601 0.6743 6.5098 7.8444 178.3874 199.6151 4.4883 9.9995 8.5556 17.6905 9.1531 34.1135 13.9368 6.8657 28.3963 29.6924 59.2111 20.9934 13.5352 53.3668 25.8788 30.2131 25.4566 61.1687 35.1250 26.1295 21.3426 39.5965 20.9476 41.2487 40.5670 18.6368 9.8785 80.2962 7.6696
temp: 298.150 k
press: 1.00000 atm
elementType: 8 8 6 6 6 6 6 6 6 6 6 6 6 6 6 6 6 6 6 6 6 6 6 1 1 1 1 1 1 1 1 1 1 1 1 1 1 1 1 1 1 1 1 1 1 1 1 1 1 1 1
symmnumber: 1
zpe: 1151282.9 jmol-1
zpe.correction: 0.438501 hartree
zpe.thermalcorrener: 0.460287 hartree
zpe.thermalcorrenthalpy: 0.461231 hartree
zpe.thermalcorrgfe: 0.389874 hartree
zpe.sumelectzpe: -965.669250 hartree
zpe.sumelectthermal: -965.647463 hartree
zpe.sumelectthermalent: -965.646519 hartree
zpe.sumelectthermalfe: -965.717876 hartree
dipole: 4.8217 -0.9993 -2.2917
dipole: 5.4314
quadrupole: -182.7438 -129.3077 -139.0452
quadrupole: -6.0574 3.7249 -3.0668
quadrupole: -32.3782 21.0579 11.3204 -6.0574 3.7249 -3.0668
hfenergy: -966.1077501 hartree
pointgroup: C01 [X(C21H28O2)]
dipole: -1.8978836 -0.3729497 0.9083677 debye
polarizability: 302.7609051|8.4398588|207.4820881|-16.0005228|-0.2460819|163.311814 unknown
InChI: InChI=1S/C21H28O2/c1-4-21(23)10-8-18-19-13(2)11-14-12-15(22)5-6-16(14)17(19)7-9-20(18,21)3/h1,12-13,16-19,23H,5-11H2,2-3H3
charge 0 multiplicity 1
51 atoms
O  -3.595127 0.006897 -1.89509
O  6.265236 -0.395527 -0.624114
C  -1.465076 0.827775 -0.066286
C  -2.311266 -0.447616 0.237425
C  -0.033077 0.741915 0.494994
C  0.683968 -0.503345 -0.117281
C  -1.624569 -1.662562 -0.42415
C  -3.69068 -0.007139 -0.403131
C  -2.383426 1.995842 0.366876
C  -0.156624 -1.800915 0.061832
C  0.795204 2.043948 0.278646
C  2.132976 -0.691402 0.454708
C  -3.82215 1.502534 0.000995
C  2.187277 1.854424 0.943073
C  -2.525402 -0.700678 1.75339
C  2.918928 0.620813 0.449833
C  2.893078 -1.818091 -0.296055
C  0.938324 2.480892 -1.19878
C  -4.835476 -0.84789 -0.0183
C  4.401664 -1.850565 0.026745
C  4.235958 0.689189 0.070791
C  5.061935 -0.496523 -0.232093
C  -5.789759 -1.579458 0.252804
H  -1.39131 0.873669 -1.173131
H  -0.090955 0.594816 1.597418
H  0.781599 -0.322059 -1.210034
H  -1.619408 -1.522933 -1.523884
H  -2.175068 -2.600148 -0.207232
H  -2.135046 2.940948 -0.147185
H  -2.294996 2.180301 1.454841
H  -0.139304 -2.098691 1.130528
H  0.316952 -2.628832 -0.497911
H  0.276543 2.860224 0.822435
H  2.015587 -0.992876 1.523494
H  -4.530038 1.624023 0.837988
H  -4.236616 2.03872 -0.868994
H  2.030505 1.744575 2.038969
H  2.815366 2.753182 0.797851
H  -1.56934 -0.86398 2.278185
H  -3.03674 0.143066 2.249534
H  -3.148661 -1.600297 1.902979
H  2.760966 -1.663274 -1.38657
H  2.447909 -2.800007 -0.054621
H  1.507231 1.744752 -1.795202
H  -0.045453 2.623674 -1.680093
H  1.483331 3.441266 -1.259995
H  -3.69564 -0.924378 -2.221702
H  4.929842 -2.622573 -0.560105
H  4.554392 -2.097985 1.098491
H  4.755895 1.655592 0.035781
H  -6.629956 -2.202292 0.498333
